1-Heptene, 2,6-dimethyl-
- Formula: C9H18
- Molecular weight: 126.2392
- IUPAC Standard InChIKey: JUUMAEXLYIMEOD-UHFFFAOYSA-N
- CAS Registry Number: 3074-78-0
- Chemical structure:
View 3d structure (requires JavaScript / HTML 5) - Other names: 2,6-Dimethyl-1-heptene

Phase change data

Data compiled as indicated in comments:
TRC - Thermodynamics Research Center, NIST Boulder Laboratories, Chris Muzny director
AC - William E. Acree, Jr., James S. Chickos
Quantity | Value | Units | Method | Reference | Comment |
---|---|---|---|---|---|
Tboil | 415. | K | N/A | Tamele, Ott, et al., 1941 | Uncertainty assigned by TRC = 5. K; TRC |
Quantity | Value | Units | Method | Reference | Comment |
ΔvapH° | 45.9 ± 0.5 | kJ/mol | GS | Verevkin, Wandschneider, et al., 2000 | Based on data from 273. to 306. K.; AC |
Enthalpy of vaporization
ΔvapH (kJ/mol) | Temperature (K) | Method | Reference | Comment |
---|---|---|---|---|
46.3 ± 0.5 | 290. | GS | Verevkin, Wandschneider, et al., 2000 | Based on data from 273. to 306. K.; AC |

Kovats' RI, non-polar column, isothermal

Column type | Active phase | Temperature (C) | I | Reference | Comment |
---|---|---|---|---|---|
Capillary | Squalane | 100. | 835. | Lulova, Leont'eva, et al., 1976 | He; Column length: 120. m; Column diameter: 0.25 mm |
Capillary | Squalane | 55. | 835. | Lulova, Leont'eva, et al., 1975 | He; Column length: 120. m; Column diameter: 0.25 mm |

Van Den Dool and Kratz RI, non-polar column, temperature ramp

Column type | Active phase | I | Reference | Comment |
---|---|---|---|---|
Capillary | HP-5 | 866. | Flamini, Tebano, et al., 2006 | 30. m/0.25 mm/0.25 μm, N2, 60. C @ 10. min, 5. K/min; Tend: 220. C |
Capillary | HP-5 | 866. | Ertugrul, Dural, et al., 2003 | 30. m/0.25 mm/0.25 μm, N2, 60. C @ 10. min, 5. K/min; Tend: 220. C |
Capillary | DB-5 | 866. | Flamini, Luigi Cioni, et al., 2003 | 30. m/0.25 mm/0.25 μm, He, 3. K/min; Tstart: 60. C; Tend: 240. C |
Capillary | Cross-Linked Methylsilicone | 848. | Khorasheh, Gray, et al., 1989 | 5. K/min; Tstart: 40. C; Tend: 300. C |

Van Den Dool and Kratz RI, polar column, temperature ramp

Column type | Active phase | I | Reference | Comment |
---|---|---|---|---|
Capillary | HP-Wax | 844. | Flamini, Tebano, et al., 2006 | 30. m/0.25 mm/0.25 μm, N2, 60. C @ 10. min, 5. K/min; Tend: 220. C |

Normal alkane RI, non-polar column, temperature ramp

Column type | Active phase | I | Reference | Comment |
---|---|---|---|---|
Capillary | Ultra-ALLOY-5 | 853. | Tsuge, Ohtan, et al., 2011 | 30. m/0.25 mm/0.25 μm, 40. C @ 2. min, 20. K/min, 320. C @ 13. min |
Capillary | DB-5 | 865. | Flamini, Ertugrul, et al., 2002 | 30. m/0.25 mm/0.25 μm, He, 3. K/min; Tstart: 60. C; Tend: 240. C |

References

Tamele, Ott, et al., 1941
Tamele, M.; Ott, C.J.; Marple, K.E.; Hearne. G.,
Derivatives of Allylic Chlorides,
Ind. Eng. Chem., 1941, 33, 115. [all data]
Verevkin, Wandschneider, et al., 2000
Verevkin, Sergey P.; Wandschneider, Dirk; Heintz, Andreas,
Determination of Vaporization Enthalpies of Selected Linear and Branched C 7 , C 8 , C 9 , C 11 , and C 12 Monoolefin Hydrocarbons from Transpiration and Correlation Gas-Chromatography Methods,
J. Chem. Eng. Data, 2000, 45, 4, 618-625, https://doi.org/10.1021/je990297k
. [all data]
Lulova, Leont'eva, et al., 1976
Lulova, N.I.; Leont'eva, S.A.; Timofeeva, A.N.,
Gas-chromatographic method of determination of individual hydrocarbons in catalytic cracking gasolines
in Proceedings of All-Union Research Institute on Oil Processes. Vol.18, All-Union Research Institute on Oil Processes, Moscow, 1976, 30-53. [all data]
Lulova, Leont'eva, et al., 1975
Lulova, N.I.; Leont'eva, S.A.; Fedosova, A.K.; Kvasova, V.A.,
Individual composition of hydrocarbons in naphthas from secondary processes,
Chem. Technol. Fuels Oils (Engl. Transl.), 1975, 11, 1/2, 59-64, https://doi.org/10.1007/BF00717315
. [all data]
Flamini, Tebano, et al., 2006
Flamini, G.; Tebano, M.; Cioni, P.L.; Bagci, Y.; Dural, H.; Ertugrul, K.; Uysal, T.; Savran, A.,
A multivariate statistical approach to Centaurea classification using essential oil composition data of some species from Turkey,
Pl. Syst. Evol., 2006, 261, 1-4, 217-228, https://doi.org/10.1007/s00606-006-0448-3
. [all data]
Ertugrul, Dural, et al., 2003
Ertugrul, K.; Dural, H.; Tugay, O.; Flamini, G.; Cioni, P.L.; Morelli, I.,
Essential oils from flowers of Centaurea kotschyi var. kotschyi and C. kotschyi var. decumbens from Turkey,
Flavour Fragr. J., 2003, 18, 2, 95-97, https://doi.org/10.1002/ffj.1168
. [all data]
Flamini, Luigi Cioni, et al., 2003
Flamini, G.; Luigi Cioni, P.; Morelli, I.,
Volatiles from leaves, fruits, and virgin oil from Olea europaea Cv. Olivastra Seggianese from Italy,
J. Agric. Food Chem., 2003, 51, 5, 1382-1386, https://doi.org/10.1021/jf020854y
. [all data]
Khorasheh, Gray, et al., 1989
Khorasheh, F.; Gray, M.R.; Selucky, M.L.,
Correlation for Kováts retention index of C9-C26 monoalkyl and polymethyl alkanes and alkenes,
J. Chromatogr., 1989, 481, 1-16, https://doi.org/10.1016/S0021-9673(01)96747-0
. [all data]
Tsuge, Ohtan, et al., 2011
Tsuge, S.; Ohtan, H.; Watanabe, C.,
Pyrolysis - GC/MS Data Book of Synthetic Polymers, Elsevier, 2011, 420. [all data]
Flamini, Ertugrul, et al., 2002
Flamini, G.; Ertugrul, K.; Cioni, P.L.; Morelli, I.; Dural, H.; Bagci, Y.,
Volatile constituents of two endemic Centaurea species from Turkey: C. pseudoscabiosa subsp. pseudoscabiosa and C. hadimensis,
Biochem. Syst. Ecol., 2002, 30, 10, 953-959, https://doi.org/10.1016/S0305-1978(02)00043-1
. [all data]