Dibenzo[b,e][1,4]dioxin, 1,2,3,4-tetrachloro-
- Formula: C12H4Cl4O2
- Molecular weight: 321.971
- IUPAC Standard InChIKey: DJHHDLMTUOLVHY-UHFFFAOYSA-N
- CAS Registry Number: 30746-58-8
- Chemical structure:
View 3d structure (requires JavaScript / HTML 5) - Other names: Dibenzo-p-dioxin, 1,2,3,4-tetrachloro-; 1,2,3,4-Tetrachlorodibenzo-p-dioxin; 1,2,3,4-Tetrachlorodibenzodioxin; 1,2,3,4-Tetrachlorodibenzo-para-dioxin; 1,2,3,4-Tcdd; 1,2,3,4-Tetrachlorodibenzo[b,e] [1,4]dioxin

Phase change data

Data compiled by: William E. Acree, Jr., James S. Chickos
Enthalpy of sublimation
ΔsubH (kJ/mol) | Temperature (K) | Method | Reference | Comment |
---|---|---|---|---|
111.3 ± 1.4 | 390. | ME | Li, Shibata, et al., 2004 | Based on data from 378. to 403. K. |

Normal alkane RI, non-polar column, temperature ramp

Data compiled by: NIST Mass Spectrometry Data Center, William E. Wallace, director

Column type Capillary
Active phase DB-5
Column length (m) 60.
Carrier gas He
Substrate
Column diameter (mm) 0.25
Phase thickness (μm) 0.25
Tstart (C) 170.
Tend (C) 340.
Heat rate (K/min) 2.
Initial hold (min) 1.
Final hold (min)
I 2379.
ReferenceZhao and Yu, 2007
Comment MSDC-RI

Van Den Dool and Kratz RI, non-polar column, temperature ramp

View large format table.

Column type Active phase I Reference Comment
CapillaryRTX-52340.Donnelly, Munslow, et al., 199130. m/0.25 mm/0.25 μm, He, 170. C @ 1. min, 2. K/min; Tend: 320. C
CapillaryRTX-52340.Donnelly, Munslow, et al., 1991, 230. m/0.25 mm/0.25 μm, He, 170. C @ 1. min, 2. K/min; Tend: 320. C
CapillaryDB-52379.Donnelly, Munslow, et al., 198760. m/0.252 mm/0.25 μm, He, 170. C @ 1. min, 2. K/min; Tend: 340. C

Van Den Dool and Kratz RI, non-polar column, custom temperature program

View large format table.

Column type Active phase I Reference Comment
CapillaryHP-52379.Korhonen and Mantykoski, 198925. m/0.20 mm/0.11 μm, He; Program: 100 0C (1 min) 20 0C/min -> 180 0C 5 0C/min -> 290 0C (until elution of the last peak)

Normal alkane RI, non-polar column, custom temperature program

View large format table.

Column type Active phase I Reference Comment
CapillaryDB-52379.Lin, Liu, et al., 2002Program: not specified
CapillaryDB-52402.Lin, Liu, et al., 2002Program: not specified
CapillaryDB-52402.Lin, Liu, et al., 2002Program: not specified

Lee's RI, non-polar column, temperature ramp

View large format table.

Column type Active phase I Reference Comment
CapillaryDB-5386.063Tong, Shore, et al., 1984He, 80. C @ 1. min, 3. K/min, 300. C @ 10. min; Column length: 30. m; Column diameter: 0.32 mm

Henry's Law data

Data compiled by: Rolf Sander

Henry's Law constant (water solution)

kH(T) = H exp(d(ln(kH))/d(1/T) ((1/T) - 1/(298.15 K)))
H = Henry's law constant for solubility in water at 298.15 K (mol/(kg*bar))
d(ln(kH))/d(1/T) = Temperature dependence constant (K)

H (mol/(kg*bar)) d(ln(kH))/d(1/T) (K) Method Reference Comment
50. MN/A
27. XShiu, Doucette, et al., 1988Value given here as quoted by missing citation.

References

Li, Shibata, et al., 2004
Li, Xian-Wei; Shibata, Etsuro; Kasai, Eiki; Nakamura, Takashi,
VAPOR PRESSURES AND ENTHALPIES OF SUBLIMATION OF 17 POLYCHLORINATED DIBENZO-p-DIOXINS AND FIVE POLYCHLORINATED DIBENZOFURANS,
Environ Toxicol Chem, 2004, 23, 2, 348-808, https://doi.org/10.1897/03-193
. [all data]