2,2,5-trimethyl-3-hexene
- Formula: C9H18
- Molecular weight: 126.2392
- IUPAC Standard InChIKey: TWZONWQQRUSASE-VOTSOKGWSA-N
- CAS Registry Number: 3074-65-5
- Chemical structure:
View 3d structure (requires JavaScript / HTML 5) - Species with the same structure:

Phase change data

Data compiled by: Thermodynamics Research Center, NIST Boulder Laboratories, Chris Muzny director
Quantity | Value | Units | Method | Reference | Comment |
---|---|---|---|---|---|
Tboil | 395.36 | K | N/A | Howard, Mears, et al., 1947 | Uncertainty assigned by TRC = 0.1 K |
Tboil | 387.15 | K | N/A | Henne, Chanan, et al., 1941 | Uncertainty assigned by TRC = 2. K |
Quantity | Value | Units | Method | Reference | Comment |
Tfus | 194.95 | K | N/A | Howard, Mears, et al., 1947 | Uncertainty assigned by TRC = 0.2 K |

References

Howard, Mears, et al., 1947
Howard, F.L.; Mears, T.W.; Fookson, A.; Pomerantz, P.; Brooks, D.B.,
Preparation and physical properties of several aliphatic hydrocarbons and intermediates,
J. Res. Natl. Bur. Stand. (U. S.), 1947, 38, 365. [all data]
Henne, Chanan, et al., 1941
Henne, A.L.; Chanan, H.H.; Turk, A.,
Olefins and Diolefins from Allylic Chlorides,
J. Am. Chem. Soc., 1941, 63, 3474-6. [all data]