6H-benzo[cd]pyren-6-one

Phase change data

Data compiled by: William E. Acree, Jr., James S. Chickos

Enthalpy of fusion

ΔfusH (kJ/mol) Temperature (K) Method Reference
13.1524.2DSCKestens, Auclair, et al., 2010

References

Kestens, Auclair, et al., 2010
Kestens, Vikram; Auclair, Guy; Drozdzewska, Katarzyna; Held, Andrea; Roebben, Gert; Linsinger, Thomas, Thermodynamic property values of selected polycyclic aromatic hydrocarbons measured by differential scanning calorimetry, J Therm Anal Calorim, 2010, 99, 1, 245-261, https://doi.org/10.1007/s10973-009-0440-6 . [all data]