3-Iodo-2-butanone
- Formula: C4H7IO
- Molecular weight: 198.0023
- IUPAC Standard InChIKey: FPEIUGALYUCCPS-UHFFFAOYSA-N
- CAS Registry Number: 30719-18-7
- Chemical structure:
View 3d structure (requires JavaScript / HTML 5) - Permanent link for this species. Use this link for bookmarking this species for future reference.

Gas phase thermochemistry data

Data compiled by: Hussein Y. Afeefy, Joel F. Liebman, and Stephen E. Stein
Quantity | Value | Units | Method | Reference | Comment |
---|---|---|---|---|---|
ΔfH°gas | -160. ± 3. | kJ/mol | Kin | Solly, Golden, et al., 1970 | |
ΔfH°gas | -160. ± 3. | kJ/mol | Eqk | Solly, Golden, et al., 1970 | Spectrophotometry |

Reaction thermochemistry data

Data compiled by: Hussein Y. Afeefy, Joel F. Liebman, and Stephen E. Stein
Individual Reactions
By formula: HI + C4H7IO = I2 + C4H8O
Quantity | Value | Units | Method | Reference | Comment |
---|---|---|---|---|---|
ΔrH° | -42.7 | kJ/mol | Kin | Solly, Golden, et al., 1970 | gas phase |

References

Solly, Golden, et al., 1970
Solly, R.K.; Golden, D.M.; Benson, S.W.,
Kinetics and thermochemistry of the gas phase reaction of methyl ethyl ketone with iodine. II. The heat of formation and unimolecular decomposition of 2-iodo-3-butanone,
Int. J. Chem. Kinet., 1970, 2, 393-407. [all data]