trimethoxyoctadecylsilane
- Formula: C21H46O3Si
- Molecular weight: 374.6736
- CAS Registry Number: 3069-42-9

Phase change data

Data compiled by: Robert L. Brown and Stephen E. Stein
Reduced pressure boiling point
Tboil (K) | Pressure (bar) | Reference |
---|---|---|
423. to 425. | 0.003 | PCR Inc., 1990 |

References

PCR Inc., 1990
PCR Inc.,
Research Chemicals Catalog 1990-1991, PCR Inc., Gainesville, FL, 1990, 1. [all data]