2-Oxetanone, 4-methyl-
- Formula: C4H6O2
- Molecular weight: 86.0892
- IUPAC Standard InChIKey: GSCLMSFRWBPUSK-UHFFFAOYSA-N
- CAS Registry Number: 3068-88-0
- Chemical structure:
View 3d structure (requires JavaScript / HTML 5) - Other names: β-Butyrolactone; β-Butyrolakton; 3-Hydroxybutanoic acid, β-lactone; Hydroxybutyric acid lactone; 3-Hydroxybutyric acid lactone; 3-Hydroxybutyric acid, β-lactone; 4-Methyl-2-oxetanone; Butanoic acid, 3-hydroxy-, beta-lactone; DL-β-Butyrolactone; 2-butenoic lactone; 4-methyloxetan-2-one

Gas phase thermochemistry data

Data compiled by: Glushko Thermocenter, Russian Academy of Sciences, Moscow
Constant pressure heat capacity of gas
Cp,gas (cal/mol*K) | Temperature (K) | Reference | Comment |
---|---|---|---|
14.73 | 200. | Durig J.R., 1968 | |
19.39 | 273.15 | ||
21.04 | 298.15 | ||
21.16 | 300. | ||
27.440 | 400. | ||
32.997 | 500. | ||
37.672 | 600. | ||
41.315 | 700. | ||
44.422 | 800. | ||
47.029 | 900. | ||
49.340 | 1000. |

References

Durig J.R., 1968
Durig J.R.,
Vibrational spectra and structure of small-ring compounds. XI. beta-Butyrolactone,
J. Mol. Struct., 1968, 2, 377-390. [all data]