α-Ionone
- Formula: C13H20O
- Molecular weight: 192.2973
- IUPAC Standard InChIKey: UZFLPKAIBPNNCA-BQYQJAHWSA-N
- CAS Registry Number: 30685-95-1
- Chemical structure:
View 3d structure (requires JavaScript / HTML 5) - Species with the same structure:
- Other names: 3-Buten-2-one, 4-(2,6,6-trimethyl-2-cyclohexen-1-yl)-, (E)-; α-Cyclocitrylideneacetone; (E)-α-Ionone; trans-α-Ionone; 3-Buten-2-one, 4-(2,6,6-trimethyl-2-cyclohexen-1-yl)-, trans; 4-(2,6,6-Trimethyl-2-cyclohexen-1-yl)-3-buten-2-one, (E)-; (3E)-4-(2,6,6-Trimethyl-2-cyclohexen-1-yl)-3-buten-2-one; α-(E)-Ionone; trans-4-(2,6,6-Trimethyl-2-cyclohexen-1-yl)-3-buten-2-one; 3-Buten-2-one, 4-(2,6,6-trimethyl-2-cyclohexen-1-yl)-, (3E)-; Ionone; 4-(2,6,6-trimethyl-2-cyclohexen-1-yl)-3-buten-2-one (α-ionone); 4-(2,6,6-Trimethyl-2-cyclohexen-1-yl)-3-buten-2-one; 4-(2,6,6-trimethylcyclohex-2-ene-1-yl)-but-3-ene-2-one; 3-Buten-2-one, 4-(2,6,6-trimethyl-2-cyclohexen-1-yl)-, (E)-(.+/-.)-

Condensed phase thermochemistry data

Data compiled by: Hussein Y. Afeefy, Joel F. Liebman, and Stephen E. Stein
Quantity | Value | Units | Method | Reference | Comment |
---|---|---|---|---|---|
ΔcH°liquid | -7697.3 | kJ/mol | Ccb | Roth-Greifswald, 1911 | Heat of combustion corrected for pressure; Corresponding ΔfHºliquid = -277. kJ/mol (simple calculation by NIST; no Washburn corrections) |

References

Roth-Greifswald, 1911
Roth-Greifswald, W.A.,
XVIII. Hauptversammlung der Deutschen Bunsen-Gesellschaft fur angewandte physikalische Chemie,
Z. Electrochem., 1911, 17, 789-840. [all data]