1,2,4-Butanetriol
- Formula: C4H10O3
- Molecular weight: 106.1204
- IUPAC Standard InChIKey: ARXKVVRQIIOZGF-UHFFFAOYSA-N
- CAS Registry Number: 3068-00-6
- Chemical structure:
View 3d structure (requires JavaScript / HTML 5) - Other names: Butane-1,2,4-triol; Triol 124; 1,2,4-Trihydroxybutane; 1,3,4-Butanetriol; 2-Deoxyerythritol; 1,2,4-Butantriol; HOCH2CH(OH)CH2CH2OH

Phase change data

Data compiled by: Robert L. Brown and Stephen E. Stein
Reduced pressure boiling point
Tboil (K) | Pressure (bar) | Reference |
---|---|---|
463.7 | 0.024 | Aldrich Chemical Company Inc., 1990 |
440. to 441. | 0.015 | Frinton Laboratories Inc., 1986 |

Reaction thermochemistry data

Data compiled by: Michael M. Meot-Ner (Mautner) and Sharon G. Lias
Individual Reactions
By formula: C4H11O3+ + C4H10O3 = (C4H11O3+ • C4H10O3)
Bond type: Hydrogen bonds of the type OH-O between organics
Free energy of reaction
ΔrG° (kJ/mol) | T (K) | Method | Reference | Comment |
---|---|---|---|---|
57.3 | 500. | PHPMS | Sunner, Kulatunga, et al., 1986 | gas phase |

Henry's Law data

Data compiled by: Rolf Sander
Henry's Law constant (water solution)
kH(T) = k°H exp(d(ln(kH))/d(1/T) ((1/T) - 1/(298.15 K)))
k°H = Henry's law constant for solubility in water at 298.15 K (mol/(kg*bar))
d(ln(kH))/d(1/T) = Temperature dependence constant (K)
k°H (mol/(kg*bar)) | d(ln(kH))/d(1/T) (K) | Method | Reference | Comment |
---|---|---|---|---|
3.0×10+11 | E | N/A | Value obtained by missing citation using the group contribution method. |

Gas phase ion energetics data

Data evaluated by: Edward P. Hunter and Sharon G. Lias
Quantity | Value | Units | Method | Reference | Comment |
---|---|---|---|---|---|
Proton affinity (review) | 905.9 | kJ/mol | N/A | Hunter and Lias, 1998 | |
Quantity | Value | Units | Method | Reference | Comment |
Gas basicity | 841. | kJ/mol | N/A | Hunter and Lias, 1998 |

Ion clustering data

Data compiled by: Michael M. Meot-Ner (Mautner) and Sharon G. Lias
Clustering reactions
By formula: C4H11O3+ + C4H10O3 = (C4H11O3+ • C4H10O3)
Bond type: Hydrogen bonds of the type OH-O between organics
Free energy of reaction
ΔrG° (kJ/mol) | T (K) | Method | Reference | Comment |
---|---|---|---|---|
57.3 | 500. | PHPMS | Sunner, Kulatunga, et al., 1986 | gas phase |

References

Aldrich Chemical Company Inc., 1990
Aldrich Chemical Company Inc.,
Catalog Handbook of Fine Chemicals, Aldrich Chemical Company, Inc., Milwaukee WI, 1990, 1. [all data]
Frinton Laboratories Inc., 1986
Frinton Laboratories Inc.,
Catalog Number 11, Frinton Laboratories Inc., Vineland, NJ, 1986, 99. [all data]
Sunner, Kulatunga, et al., 1986
Sunner, J.A.; Kulatunga, R.; Kebarle, P.,
Fast Atom Bombardment Mass Spectrometry and Gas Phase Basicities,
Anal. Chem., 1986, 58, 7, 1312, https://doi.org/10.1021/ac00298a010
. [all data]
Hunter and Lias, 1998
Hunter, E.P.; Lias, S.G.,
Evaluated Gas Phase Basicities and Proton Affinities of Molecules: An Update,
J. Phys. Chem. Ref. Data, 1998, 27, 3, 413-656, https://doi.org/10.1063/1.556018
. [all data]