3,5,1,7-[1,2,3,4]Butanetetraylnaphthalen-3(2H)-ol, octahydro
- Formula: C14H20O
- Molecular weight: 204.3080
- IUPAC Standard InChIKey: HLMNGNITCLNFFJ-UHFFFAOYSA-N
- CAS Registry Number: 30651-03-7
- Chemical structure:
View 3d structure (requires JavaScript / HTML 5) - Other names: Diamantan-4-ol

Gas phase thermochemistry data

Data compiled by: Hussein Y. Afeefy, Joel F. Liebman, and Stephen E. Stein
Quantity | Value | Units | Method | Reference | Comment |
---|---|---|---|---|---|
ΔfH°gas | -317.1 ± 1.6 | kJ/mol | Ccb | Clark, Knox, et al., 1980 |

Condensed phase thermochemistry data

Data compiled by: Hussein Y. Afeefy, Joel F. Liebman, and Stephen E. Stein
Quantity | Value | Units | Method | Reference | Comment |
---|---|---|---|---|---|
ΔfH°solid | -435.0 ± 1.6 | kJ/mol | Ccb | Clark, Knox, et al., 1980 | |
Quantity | Value | Units | Method | Reference | Comment |
ΔcH°solid | -7932.5 ± 1.6 | kJ/mol | Ccb | Clark, Knox, et al., 1980 | Corresponding ΔfHºsolid = -434.97 kJ/mol (simple calculation by NIST; no Washburn corrections) |

Phase change data

Data compiled as indicated in comments:
TRC - Thermodynamics Research Center, NIST Boulder Laboratories, Chris Muzny director
ALS - Hussein Y. Afeefy, Joel F. Liebman, and Stephen E. Stein
DRB - Donald R. Burgess, Jr.
AC - William E. Acree, Jr., James S. Chickos
Quantity | Value | Units | Method | Reference | Comment |
---|---|---|---|---|---|
Tfus | 484. | K | N/A | Clark, McKervey, et al., 1974 | Crystal phase 1 phase; Uncertainty assigned by TRC = 1. K; TRC |
Quantity | Value | Units | Method | Reference | Comment |
ΔsubH° | 117.8 ± 0.2 | kJ/mol | C | Clark, Knox, et al., 1980 | ALS |
ΔsubH° | 117.9 | kJ/mol | N/A | Clark, Knox, et al., 1980 | DRB |
Enthalpy of sublimation
ΔsubH (kJ/mol) | Temperature (K) | Reference | Comment |
---|---|---|---|
117.8 ± 0.2 | 337. | Clark, Knox, et al., 1980, 2 | Based on data from 322. to 353. K. See also Clark, Knox, et al., 1975.; AC |
Enthalpy of fusion
ΔfusH (kJ/mol) | Temperature (K) | Method | Reference | Comment |
---|---|---|---|---|
16.4 | 484. | DSC | Clark, McKervey, et al., 1974 | AC |

References

Clark, Knox, et al., 1980
Clark, T.; Knox, T.M.; McKervey, M.A.; Mackle, H.,
Thermochemistry of bridged-ring substances. Enthalpies of formation of diamantan-1-, -3-, and -4-ol and of diamantanone,
J. Chem. Soc. Perkin Trans. 2, 1980, 1686-1689. [all data]
Clark, McKervey, et al., 1974
Clark, Timothy; McKervey, M. Anthony; Mackle, Henry; Rooney, John J.,
Pre-melting transitions in caged hydrocarbons, a general theory of disorder in plastic crystals,
J. Chem. Soc., Faraday Trans. 1, 1974, 70, 0, 1279, https://doi.org/10.1039/f19747001279
. [all data]
Clark, Knox, et al., 1980, 2
Clark, Timothy; Knox, McO.; McKervey, M. Anthony; Mackle, Henry,
Thermochemistry of bridged-ring substances. Enthalpies of formation of diamantan-1-, -3-, and -4-ol and of diamantanone,
J. Chem. Soc., Perkin Trans. 2, 1980, 11, 1686, https://doi.org/10.1039/p29800001686
. [all data]
Clark, Knox, et al., 1975
Clark, Timothy; Knox, Trevor; Mackle, Henry; McKervey, M. Anthony; Rooney, John J.,
Heats of sublimation of some cage hydrocarbons by a temperature scanning technique,
J. Chem. Soc., Faraday Trans. 1, 1975, 71, 0, 2107, https://doi.org/10.1039/f19757102107
. [all data]