cyclohexene, 1,4,5-trimethyl-, cis-
- Formula: C9H16
- Molecular weight: 124.2233
- IUPAC Standard InChIKey: FNZUANSNHGITHR-BDAKNGLRSA-N
- CAS Registry Number: 30631-18-6
- Chemical structure:
View 3d structure (requires JavaScript / HTML 5) - Stereoisomers:

Phase change data

Data compiled by: Thermodynamics Research Center, NIST Boulder Laboratories, Chris Muzny director
Quantity | Value | Units | Method | Reference | Comment |
---|---|---|---|---|---|
Tboil | 420. | K | N/A | Skita and Schneck, 1922 | Uncertainty assigned by TRC = 4. K |

References

Skita and Schneck, 1922
Skita, A.; Schneck, A.,
Stereoismerism in Cyclic Hydrocarbons,
Chem. Ber., 1922, 55, 144-52. [all data]