Benzene, 1,4-diphenoxy-
- Formula: C18H14O2
- Molecular weight: 262.3026
- IUPAC Standard InChIKey: UVGPELGZPWDPFP-UHFFFAOYSA-N
- CAS Registry Number: 3061-36-7
- Chemical structure:
View 3d structure (requires JavaScript / HTML 5) - Other names: Benzene, p-diphenoxy-; p-Diphenoxybenzene; p-Phenoxyphenoxybenzene; Hydroquinone diphenyl ether; 1,4-Diphenoxybenzene; 4-Phenoxydiphenyl oxide

Phase change data

Data compiled by: Robert L. Brown and Stephen E. Stein
Reduced pressure boiling point
Tboil (K) | Pressure (bar) | Reference |
---|---|---|
455. | 0.003 | Frinton Laboratories Inc., 1986 |

Lee's RI, non-polar column, temperature ramp

Column type | Active phase | I | Reference | Comment |
---|---|---|---|---|
Capillary | HP-5 | 357.8 | Wang, Hou, et al., 2007 | 30. m/0.30 mm/0.25 μm, Helium, 50. C @ 5. min, 5. K/min, 200. C @ 15. min |

References

Frinton Laboratories Inc., 1986
Frinton Laboratories Inc.,
Catalog Number 11, Frinton Laboratories Inc., Vineland, NJ, 1986, 99. [all data]
Wang, Hou, et al., 2007
Wang, G.; Hou, Z.; Sun, Y.; Liu, Y.; Xie, B.; Liu, S.,
Investigation of pyrolysis behavior of fenoxycarb using PY-GC-MS assisted with chemometric methods,
Chem. Anal., 2007, 52, 141-156. [all data]