Metobromuron
- Formula: C9H11BrN2O
- Molecular weight: 243.100
- IUPAC Standard InChIKey: WLFDQEVORAMCIM-UHFFFAOYSA-N
- CAS Registry Number: 3060-89-7
- Chemical structure:
View 3d structure (requires JavaScript / HTML 5) - Other names: Urea, N'-(4-bromophenyl)-N-methoxy-N-methyl-; Urea, 3-(p-bromophenyl)-1-methoxy-1-methyl-; C 3126; Metbromuron; Patoran; 3-(p-Bromophenyl)-1-Methoxy-1-methylurea; 3-(4-Bromophenyl)-1-methoxy-1-methylurea; 3-(4-Bromphenyl)-1-methoxyharnstoff; N'-(4-Bromophenyl)-N-methoxy-N-methylurea; 3-(p-Bromophenyl)-1-methyl-1-methoxyurea; CIBA-3126; Pattonex; Patoran FL; Monobromuron; N-(p-Bromophenyl)-N'-methyl-N'-methoxyurea

Phase change data

Data compiled as indicated in comments:
TRC - Thermodynamics Research Center, NIST Boulder Laboratories, Chris Muzny director
AC - William E. Acree, Jr., James S. Chickos
Quantity | Value | Units | Method | Reference | Comment |
---|---|---|---|---|---|
Tfus | 368.88 | K | N/A | Donnelly, Drewes, et al., 1990 | Uncertainty assigned by TRC = 0.2 K; TRC |
Tfus | 369. | K | N/A | Plato, 1972 | Uncertainty assigned by TRC = 0.2 K; TRC |
Enthalpy of fusion
ΔfusH (kcal/mol) | Temperature (K) | Method | Reference | Comment |
---|---|---|---|---|
5.841 | 368.3 | DSC | Acree, 1991 | See also Donnelly, Drewes, et al., 1990, 2.; AC |

References

Donnelly, Drewes, et al., 1990
Donnelly, J.R.; Drewes, L.A.; Johnson, R.L.; Munslow, W.D.; Knapp, K.K.; Sovocool, G.W.,
Purity and heat of fusion data for environmental standards as determined by differential scanning calorimetry,
Thermochim. Acta, 1990, 167, 2, 155, https://doi.org/10.1016/0040-6031(90)80476-F
. [all data]
Plato, 1972
Plato, C.,
DSC as a general method for determining purity and heat of fusion of high-purity organic chemicals,
Anal. Chem., 1972, 44, 1531. [all data]
Acree, 1991
Acree, William E.,
Thermodynamic properties of organic compounds: enthalpy of fusion and melting point temperature compilation,
Thermochimica Acta, 1991, 189, 1, 37-56, https://doi.org/10.1016/0040-6031(91)87098-H
. [all data]
Donnelly, Drewes, et al., 1990, 2
Donnelly, J.R.; Drewes, L.A.; Johnson, R.L.; Munslow, W.D.; Knapp, K.K.; Sovocool, G.W.,
Purity and heat of fusion data for environmental standards as determined by differential scanning calorimetry,
Thermochimica Acta, 1990, 167, 2, 155-187, https://doi.org/10.1016/0040-6031(90)80476-F
. [all data]