trichlorotoluene
- Formula: C7H5Cl3
- Molecular weight: 195.474
- IUPAC Standard InChIKey: XEMRAKSQROQPBR-UHFFFAOYSA-N
- CAS Registry Number: 30583-33-6
- Chemical structure:
View 3d structure (requires JavaScript / HTML 5) - Species with the same structure:
- Other names: Benzene, trichloromethyl-

Gas phase thermochemistry data

Data compiled by: Hussein Y. Afeefy, Joel F. Liebman, and Stephen E. Stein
Quantity | Value | Units | Method | Reference | Comment |
---|---|---|---|---|---|
ΔfH°gas | 2.99 ± 0.55 | kcal/mol | Ccr | Papina, Pimenova, et al., 1995 | HCl (1:600 H2O) |

Condensed phase thermochemistry data

Data compiled by: Hussein Y. Afeefy, Joel F. Liebman, and Stephen E. Stein
Quantity | Value | Units | Method | Reference | Comment |
---|---|---|---|---|---|
ΔfH°liquid | -10.8 ± 0.48 | kcal/mol | Ccr | Papina, Pimenova, et al., 1995 | HCl (1:600 H2O) |
Quantity | Value | Units | Method | Reference | Comment |
ΔcH°liquid | -835.30 ± 0.43 | kcal/mol | Ccr | Papina, Pimenova, et al., 1995 | HCl (1:600 H2O) |

Phase change data

Data compiled by: Hussein Y. Afeefy, Joel F. Liebman, and Stephen E. Stein
Quantity | Value | Units | Method | Reference | Comment |
---|---|---|---|---|---|
ΔvapH° | 13.8 ± 0.29 | kcal/mol | V | Papina, Pimenova, et al., 1995 | HCl (1:600 H2O) |

References

Papina, Pimenova, et al., 1995
Papina, T.S.; Pimenova, S.M.; Luk'yanova, V.A.; Kolesov, V.P.,
Standard enthalpies of formation of benzyl alcohol and α,α,α-trichlorotoluene,
Russ. J. Phys. Chem. (Engl. Transl.), 1995, 69, 1951-1953, In original 2148. [all data]