Phenol, 3-ethyl-, acetate
- Formula: C10H12O2
- Molecular weight: 164.2011
- IUPAC Standard InChIKey: KAGKFSYVRVNAND-UHFFFAOYSA-N
- CAS Registry Number: 3056-60-8
- Chemical structure:
View 3d structure (requires JavaScript / HTML 5) - Other names: Phenol, m-ethyl-, acetate; m-Ethylphenyl acetate; 3-Ethylphenol, O-acetyl-; 3-Ethylphenyl acetate

Van Den Dool and Kratz RI, non-polar column, temperature ramp

Column type | Active phase | I | Reference | Comment |
---|---|---|---|---|
Capillary | VF-5MS | 1256. | Todua, 2011 | 30. m/0.25 mm/0.25 μm, He; Tstart: 60. C; Tend: 270. C |

References

Todua, 2011
Todua, N.G.,
Retention Data. NIST Mass Spectrometry Data Center., NIST Mass Spectrometry Data Center, 2011. [all data]