Acephate
- Formula: C4H10NO3PS
- Molecular weight: 183.166
- IUPAC Standard InChIKey: YASYVMFAVPKPKE-UHFFFAOYSA-N
- CAS Registry Number: 30560-19-1
- Chemical structure:
View 3d structure (requires JavaScript / HTML 5) - Other names: Phosphoramidothioic acid, acetyl-, O,S-dimethyl ester; Acetamidophos; O,S-Dimethyl acetylphosphoramidothioate; O,S-Dimethyl N-acetylphosphoramidothioate; Orthene; Orthene-755; Ortran; RE 12420; Phosphoramidothioic acid, N-acetyl-, O,S-dimethyl ester; Acephat; Acetylphosphoramidothioic acid O,S-dimethyl ester; Chevron RE 12,420; O,S-Dimethylacetylphosphoroamidothioate; ENT 27822; N-(Methoxy(methylthio)phosphinoyl)acetamide; ORTHO 124120; Ortril; 75 SP; O,S-Dimethyl acetylamidothiophosphate; Acefate; Thiophosphamide, O,S-dimethyl, N-acetyl

Phase change data

Data compiled by: Thermodynamics Research Center, NIST Boulder Laboratories, Chris Muzny director
Quantity | Value | Units | Method | Reference | Comment |
---|---|---|---|---|---|
Tfus | 365.10 | K | N/A | Donnelly, Drewes, et al., 1990 | Uncertainty assigned by TRC = 0.2 K |

Kovats' RI, non-polar column, isothermal

Column type | Active phase | Temperature (C) | I | Reference | Comment |
---|---|---|---|---|---|
Capillary | OV-1 | 130. | 1423. | Erdmann, Rochholz, et al., 1992 | |
Capillary | OV-1 | 160. | 1437. | Erdmann, Rochholz, et al., 1992 |

Kovats' RI, non-polar column, temperature ramp

Column type | Active phase | I | Reference | Comment |
---|---|---|---|---|
Capillary | DB-1 | 1440. | Hall, Whitehead, et al., 1986 | He, 6. K/min; Column length: 15. m; Column diameter: 0.25 mm; Tstart: 100. C; Tend: 270. C |
Capillary | DB-5 | 1456. | Hall, Whitehead, et al., 1986 | He, 6. K/min; Column length: 15. m; Column diameter: 0.25 mm; Tstart: 100. C; Tend: 270. C |

Normal alkane RI, non-polar column, temperature ramp

Column type | Active phase | I | Reference | Comment |
---|---|---|---|---|
Capillary | Polydimethyl siloxane | 1452. | Hayakawa, Niinomi, et al., 1990 | 25. m/0.32 mm/0.52 μm, He, 6. K/min; Tstart: 60. C; Tend: 270. C |

Normal alkane RI, non-polar column, custom temperature program

Column type | Active phase | I | Reference | Comment |
---|---|---|---|---|
Capillary | 5 % Phenyl methyl siloxane | 1436. | Department of Food Safety and Welfare, 2006 | 30. m/0.25 mm/0.25 μm, Helium; Program: 50 0C(1 min) 25 0C/min -> 125 0C 10 0C/min -> 300 0C (10 min) |

References

Donnelly, Drewes, et al., 1990
Donnelly, J.R.; Drewes, L.A.; Johnson, R.L.; Munslow, W.D.; Knapp, K.K.; Sovocool, G.W.,
Purity and heat of fusion data for environmental standards as determined by differential scanning calorimetry,
Thermochim. Acta, 1990, 167, 2, 155, https://doi.org/10.1016/0040-6031(90)80476-F
. [all data]
Erdmann, Rochholz, et al., 1992
Erdmann, F.; Rochholz, G.; Schütz, H.,
Retention-indices on OV-1 of approximately 170 commonly used pesticides,
Mikrochim. Acta, 1992, 106, 3-6, 219-226, https://doi.org/10.1007/BF01242093
. [all data]
Hall, Whitehead, et al., 1986
Hall, G.L.; Whitehead, W.E.; Mourer, C.R.; Shibamoto, T.,
A new gas chromatographic retention index for pesticides and related compounds,
J. Hi. Res. Chromatogr. Chromatogr. Comm., 1986, 9, 5, 266-271, https://doi.org/10.1002/jhrc.1240090503
. [all data]
Hayakawa, Niinomi, et al., 1990
Hayakawa, S.; Niinomi, J.; Kato, S.; Kanamaru, T.,
Retention time and mass number of agrochemicals by capillary column GC/MS,
Mie-ken Kankyo-Kagaku Senta-kenkyu-ho-koku (Report of the Environmental Science Institute of Mie Prefecture), 1990, 10, 53-56. [all data]
Department of Food Safety and Welfare, 2006
Department of Food Safety, Ministry of Health; Welfare,
Analytical methods for residual compositional substances of agricultural chemicals, feed aadditives, and veterinary drugs in foods, 2006, retrieved from http://www.mhlw.go.jp/english/topics/foodsafety/positivelist060228/de/060526-1a.pdf. [all data]