3,5,1,7-[1,2,3,4]butanetetraylnaphthalen-1(2H)-ol, octahydro-

Phase change data

Data compiled by: Thermodynamics Research Center, NIST Boulder Laboratories, Chris Muzny director

Quantity Value Units Method Reference Comment
Tfus573.KN/AClark, McKervey, et al., 1974Crystal phase 1 phase; Uncertainty assigned by TRC = 1. K

In addition to the Thermodynamics Research Center (TRC) data available from this site, much more physical and chemical property data is available from the following TRC products:

References

Clark, McKervey, et al., 1974
Clark, Timothy; McKervey, M. Anthony; Mackle, Henry; Rooney, John J., Pre-melting transitions in caged hydrocarbons, a general theory of disorder in plastic crystals, J. Chem. Soc., Faraday Trans. 1, 1974, 70, 0, 1279, https://doi.org/10.1039/f19747001279 . [all data]