Butanoic acid, 2,3-dimethyl-, methyl ester
- Formula: C7H14O2
- Molecular weight: 130.1849
- IUPAC Standard InChIKey: YLXGEYQXFJAIBQ-UHFFFAOYSA-N
- CAS Registry Number: 30540-29-5
- Chemical structure:
View 3d structure (requires JavaScript / HTML 5) - Other names: Butyric acid, 2,3-dimethyl-, methyl ester

Kovats' RI, non-polar column, isothermal

Column type | Active phase | Temperature (C) | I | Reference | Comment |
---|---|---|---|---|---|
Packed | Squalane | 120. | 763. | Schomburg, 1964 |

References

Schomburg, 1964
Schomburg, G.,
Gas-Chromatographische Retentionsdaten und Struktur Chemischer Verbindungen. I. Verzweigte Aliphatische und Alicyclische Carbonsäure-Methylester,
J. Chromatogr., 1964, 14, 157-177, https://doi.org/10.1016/S0021-9673(00)86608-X
. [all data]