2-Propanamine, N-methyl-N-nitroso-
- Formula: C4H10N2O
- Molecular weight: 102.1350
- IUPAC Standard InChIKey: KQDYNYCCEGQPTN-UHFFFAOYSA-N
- CAS Registry Number: 30533-08-5
- Chemical structure:
View 3d structure (requires JavaScript / HTML 5) - Other names: Ethylamine, N,1-dimethyl-N-nitroso-; Isopropylmethylnitrosamine; Methylisopropylnitrosamine; N-Methyl-N-nitrosoisopropylamine; N,1-Dimethyl-N-nitrosoethanamine

Normal alkane RI, non-polar column, temperature ramp

Column type | Active phase | I | Reference | Comment |
---|---|---|---|---|
Capillary | OV-101 | 855. | Zenkevich, 2005 | 25. m/0.20 mm/0.10 μm, N2/He, 6. K/min; Tstart: 50. C; Tend: 250. C |

References

Zenkevich, 2005
Zenkevich, I.G.,
Experimentally measured retention indices., 2005. [all data]