n-Caproic acid vinyl ester
- Formula: C8H14O2
- Molecular weight: 142.1956
- IUPAC Standard InChIKey: LZWYWAIOTBEZFN-UHFFFAOYSA-N
- CAS Registry Number: 3050-69-9
- Chemical structure:
View 3d structure (requires JavaScript / HTML 5) - Other names: Hexanoic acid, ethenyl ester; Caproic acid, vinyl ester; Hexanoic acid, vinyl ester; Vinyl caproate; Vinyl hexanoate; Vinyl hexoate

Normal alkane RI, non-polar column, custom temperature program

Column type | Active phase | I | Reference | Comment |
---|---|---|---|---|
Capillary | HP-5 | 1244. | Dou, Li, et al., 2007 | 30. m/0.32 mm/0.25 μm, He; Program: 40 0C (2 min) 110 0C (2 min) 3 0C/min -> 170 0C (2 min) 4 0C/min -> 220 0C (2 min) 10 0C/min -> 260 0C (5 min) |

References

Dou, Li, et al., 2007
Dou, H.-L.; Li, C.-M.; Gu, H.-F.; Hao, J.-F.,
Comparative analysis on aromatic components of green tea and fresh green tea beverage using HS-SPME/GC-MS/GC-olfactometry/RI methods,
Journal of Tea Science, 2007, 27, 1, 51-60. [all data]