4-Chlorocyclohexanol
- Formula: C6H11ClO
- Molecular weight: 134.604
- IUPAC Standard InChIKey: HVPIAXWCSPHTAY-UHFFFAOYSA-N
- CAS Registry Number: 30485-71-3
- Chemical structure:
View 3d structure (requires JavaScript / HTML 5) - Stereoisomers:

Phase change data

Data compiled by: Robert L. Brown and Stephen E. Stein
Reduced pressure boiling point
Tboil (K) | Pressure (bar) | Reference |
---|---|---|
378. to 380. | 0.029 | Frinton Laboratories Inc., 1986 |

References

Frinton Laboratories Inc., 1986
Frinton Laboratories Inc.,
Catalog Number 11, Frinton Laboratories Inc., Vineland, NJ, 1986, 99. [all data]