1-Cyclopentene-1-carbonitrile
- Formula: C6H7N
- Molecular weight: 93.1265
- IUPAC Standard InChIKey: XBVZRFXCDCYXAX-UHFFFAOYSA-N
- CAS Registry Number: 3047-38-9
- Chemical structure:
View 3d structure (requires JavaScript / HTML 5) - Permanent link for this species. Use this link for bookmarking this species for future reference.

Condensed phase thermochemistry data

Data compiled by: Hussein Y. Afeefy, Joel F. Liebman, and Stephen E. Stein
Quantity | Value | Units | Method | Reference | Comment |
---|---|---|---|---|---|
ΔfH°liquid | 96.90 | kJ/mol | Ccb | Prochazka, Krestanova, et al., 1970 | It appears likely that data for the cyclopentene-carbonitrile isomers is swapped in table I of the paper. The data shown here are labeled as 2-Cyclopentene-1-carbonitrile in table I and 1-Cyclopentene-1-carbonitrile elsewhere in the paper. |

Phase change data

Data compiled as indicated in comments:
ALS - Hussein Y. Afeefy, Joel F. Liebman, and Stephen E. Stein
DRB - Donald R. Burgess, Jr.
Quantity | Value | Units | Method | Reference | Comment |
---|---|---|---|---|---|
ΔvapH° | 44.98 ± 0.20 | kJ/mol | C | Konicek, 1973 | ALS |
ΔvapH° | 44.94 | kJ/mol | C | Prochazka, Krestanova, et al., 1970 | It appears likely that data for the cyclopentene-carbonitrile isomers is swapped in table I of the paper. The data shown here are labeled as 2-Cyclopentene-1-carbonitrile in table I and 1-Cyclopentene-1-carbonitrile elsewhere in the paper.; ALS |
ΔvapH° | 44.9 | kJ/mol | N/A | Prochazka, Krestanova, et al., 1970 | DRB |

Gas phase thermochemistry data

Data compiled by: Hussein Y. Afeefy, Joel F. Liebman, and Stephen E. Stein
Quantity | Value | Units | Method | Reference | Comment |
---|---|---|---|---|---|
ΔfH°gas | 141.8 | kJ/mol | Ccb | Prochazka, Krestanova, et al., 1970 | It appears likely that data for the cyclopentene-carbonitrile isomers is swapped in table I of the paper. The data shown here are labeled as 2-Cyclopentene-1-carbonitrile in table I and 1-Cyclopentene-1-carbonitrile elsewhere in the paper. |
Quantity | Value | Units | Method | Reference | Comment |
ΔcH°gas | -3458.4 ± 0.10 | kJ/mol | Ccb | Prochazka, Krestanova, et al., 1970 | It appears likely that data for the cyclopentene-carbonitrile isomers is swapped in table I of the paper. The data shown here are labeled as 2-Cyclopentene-1-carbonitrile in table I and 1-Cyclopentene-1-carbonitrile elsewhere in the paper. |

References

Prochazka, Krestanova, et al., 1970
Prochazka, M.; Krestanova, V.; Konicek, J.; Smisek, M.,
Thermochemistry of nitriles. II. Alicyclic nitriles,
Collect. Czech. Chem. Commun., 1970, 35, 727-732. [all data]
Konicek, 1973
Konicek, J.,
Design and testing of a vaporisation calorimeter. Enthalpies of vaporisation of some alkyl cyanides,
Acta Chem. Scand., 1973, 27, 1496-15. [all data]