Pinocarvone
- Formula: C10H14O
- Molecular weight: 150.2176
- IUPAC Standard InChIKey: TZDMGBLPGZXHJI-UHFFFAOYSA-N
- CAS Registry Number: 30460-92-5
- Chemical structure:
View 3d structure (requires JavaScript / HTML 5) - Species with the same structure:
- Other names: 2(10)-Pinen-3-one; 6,6-Dimethyl-2-methylenebicyclo[3.1.1]heptan-3-one; α-Pinocarvone; 3-Nopinenone; 2(10)-Pinen-3-one, (.+/-.)-; Bicyclo[3.1.1]heptan-3-one, 6,6-dimethyl-2-methylene-; 547-62-6; 16812-40-1; (±)-2(10)-pinen-3-one

Van Den Dool and Kratz RI, non-polar column, custom temperature program

Column type | Active phase | I | Reference | Comment |
---|---|---|---|---|
Capillary | HP-5MS | 1164.2 | Andriamaharavo, 2014 | 30. m/0.25 mm/0.25 μm, He; Program: 60C (1 min) => 5 C/min => 210C => 10 C/min => 280C (15 min) |

References

Andriamaharavo, 2014
Andriamaharavo, N.R.,
Retention Data. NIST Mass Spectrometry Data Center., NIST Mass Spectrometry Data Center, 2014. [all data]