1,3,5-Cycloheptatriene, 2-methyl
- Formula: C8H10
- Molecular weight: 106.1650
- IUPAC Standard InChIKey: UQJRWEWFCRBHQV-UHFFFAOYSA-N
- CAS Registry Number: 3045-89-4
- Chemical structure:
View 3d structure (requires JavaScript / HTML 5) - Species with the same structure:

Reaction thermochemistry data

Data compiled by: Hussein Y. Afeefy, Joel F. Liebman, and Stephen E. Stein
Individual Reactions
C8H10 =
By formula: C8H10 = C8H10
Quantity | Value | Units | Method | Reference | Comment |
---|---|---|---|---|---|
ΔrH° | 4.60 ± 0.04 | kJ/mol | Eqk | Egger, 1968 | gas phase |

References

Egger, 1968
Egger, K.W.,
The thermal intramolecular rearrangement of methyl-1,3,5-cycloheptatrienes in the gas phase. II. thermodynamic data from equilibrium studies of the positional isomers,
J. Am. Chem. Soc., 1968, 90, 1-5. [all data]