1-Methylcycloheptatriene
- Formula: C8H10
- Molecular weight: 106.1650
- CAS Registry Number: 3045-88-3

Reaction thermochemistry data

Data compiled by: Hussein Y. Afeefy, Joel F. Liebman, and Stephen E. Stein
Individual Reactions
By formula: C8H10 = C8H10
Quantity | Value | Units | Method | Reference | Comment |
---|---|---|---|---|---|
ΔrH° | 4.60 ± 0.04 | kJ/mol | Eqk | Egger, 1968 | gas phase |

References

Egger, 1968
Egger, K.W.,
The thermal intramolecular rearrangement of methyl-1,3,5-cycloheptatrienes in the gas phase. II. thermodynamic data from equilibrium studies of the positional isomers,
J. Am. Chem. Soc., 1968, 90, 1-5. [all data]