1H-Pyrrole, 2-phenyl-
- Formula: C10H9N
- Molecular weight: 143.1852
- IUPAC Standard InChIKey: IRTLROCMFSDSNF-UHFFFAOYSA-N
- CAS Registry Number: 3042-22-6
- Chemical structure:
View 3d structure (requires JavaScript / HTML 5) - Other names: Pyrrole, 2-phenyl-; 2-Phenylpyrrole

Condensed phase thermochemistry data

Data compiled by: Hussein Y. Afeefy, Joel F. Liebman, and Stephen E. Stein
Quantity | Value | Units | Method | Reference | Comment |
---|---|---|---|---|---|
ΔcH°solid | -5360.5 ± 5.4 | kJ/mol | Ccb | Stern and Klebs, 1933 | Reanalyzed by Cox and Pilcher, 1970, Original value = -5368.1 kJ/mol; Heat of combustion at 288 K |

Phase change data

Data compiled by: Thermodynamics Research Center, NIST Boulder Laboratories, Chris Muzny director
Quantity | Value | Units | Method | Reference | Comment |
---|---|---|---|---|---|
Tfus | 403. | K | N/A | Cumper and Wood, 1971 | Uncertainty assigned by TRC = 2. K |
Tfus | 403. | K | N/A | Adkins and Coonradt, 1941 | Uncertainty assigned by TRC = 2. K |

References

Stern and Klebs, 1933
Stern, A.; Klebs, G.,
Calorimetrische Bestimmungen bei einfachen und mehrkernigen Pyrrolderivaten,
Ann., 1933, 504, 287-297. [all data]
Cox and Pilcher, 1970
Cox, J.D.; Pilcher, G.,
Thermochemistry of Organic and Organometallic Compounds, Academic Press, New York, 1970, 1-636. [all data]
Cumper and Wood, 1971
Cumper, C.W.N.; Wood, J.W.M.,
Dielectric relaxation and dipole moments of substituted pyrroles.,
J. Chem. Soc. B, 1971, 1811. [all data]
Adkins and Coonradt, 1941
Adkins, H.; Coonradt, H.L.,
The Selective Hydrogenation of Derivatives of Pyrrole, Indole, Carbazole and Acridine,
J. Am. Chem. Soc., 1941, 63, 1563-70. [all data]
(editor), 1981
(editor), Koptyug V.A.,
Atlas of Spectra of Aromatic and Heterocyclic Compounds, 1981, 21, 28. [all data]