Malononitrile, phenyl-
- Formula: C9H6N2
- Molecular weight: 142.1573
- IUPAC Standard InChIKey: OFCTVAYVCDCQDA-UHFFFAOYSA-N
- CAS Registry Number: 3041-40-5
- Chemical structure:
View 3d structure (requires JavaScript / HTML 5) - Other names: Phenyl-malonitril; Phenylmalononitrile; Propanedinitrile, phenyl-; 2-Phenylmalononitrile

Reaction thermochemistry data

Data compiled by: John E. Bartmess
Individual Reactions
C9H5N2- + =
By formula: C9H5N2- + H+ = C9H6N2
Quantity | Value | Units | Method | Reference | Comment |
---|---|---|---|---|---|
ΔrH° | 1340. ± 8.8 | kJ/mol | G+TS | Koppel, Taft, et al., 1994 | gas phase |
ΔrH° | 1342. ± 8.8 | kJ/mol | G+TS | Taft and Bordwell, 1988 | gas phase |
Quantity | Value | Units | Method | Reference | Comment |
ΔrG° | 1315. ± 8.4 | kJ/mol | IMRE | Koppel, Taft, et al., 1994 | gas phase |
ΔrG° | 1317. ± 8.4 | kJ/mol | IMRE | Taft and Bordwell, 1988 | gas phase |

Gas phase ion energetics data

Data compiled by: John E. Bartmess
De-protonation reactions
C9H5N2- + =
By formula: C9H5N2- + H+ = C9H6N2
Quantity | Value | Units | Method | Reference | Comment |
---|---|---|---|---|---|
ΔrH° | 1340. ± 8.8 | kJ/mol | G+TS | Koppel, Taft, et al., 1994 | gas phase |
ΔrH° | 1342. ± 8.8 | kJ/mol | G+TS | Taft and Bordwell, 1988 | gas phase |
Quantity | Value | Units | Method | Reference | Comment |
ΔrG° | 1315. ± 8.4 | kJ/mol | IMRE | Koppel, Taft, et al., 1994 | gas phase |
ΔrG° | 1317. ± 8.4 | kJ/mol | IMRE | Taft and Bordwell, 1988 | gas phase |

References

Koppel, Taft, et al., 1994
Koppel, I.A.; Taft, R.W.; Anvia, F.; Zhu, S.Z.; Hu, L.Q.; Sung, K.S.; Desmarteau, D.D.; Yagupolskii, L.M.,
The Gas-Phase Acidities of Very Strong Neutral Bronsted Acids,
J. Am. Chem. Soc., 1994, 116, 7, 3047, https://doi.org/10.1021/ja00086a038
. [all data]
Taft and Bordwell, 1988
Taft, R.W.; Bordwell, F.G.,
Structural and Solvent Effects Evaluated from Acidities Measured in Dimethyl Sulfoxide and in the Gas Phase,
Acc. Chem. Res., 1988, 21, 12, 463, https://doi.org/10.1021/ar00156a005
. [all data]