Oxazole, 4-ethyl-2,5-dimethyl-
- Formula: C7H11NO
- Molecular weight: 125.1683
- IUPAC Standard InChIKey: YZZBROGKUWYQOL-UHFFFAOYSA-N
- CAS Registry Number: 30408-61-8
- Chemical structure:
View 3d structure (requires JavaScript / HTML 5) - Other names: 2,5-Dimethyl-4-ethyloxazole; 4-ethyl-2,5-dimethyloxazole

Kovats' RI, non-polar column, isothermal

Column type | Active phase | Temperature (C) | I | Reference | Comment |
---|---|---|---|---|---|
Capillary | OV-101 | 110. | 923. | Golovnya, Zhuravleva, et al., 1991 | 50. m/0.30 mm/0.4 μm, He |

Kovats' RI, polar column, isothermal

Column type | Active phase | Temperature (C) | I | Reference | Comment |
---|---|---|---|---|---|
Capillary | PEG-40M | 110. | 1252. | Golovnya, Zhuravleva, et al., 1991 | 50. m/0.30 mm/0.4 μm, He |
Capillary | PEG-40M | 110. | 1213. | Zhuravleva, Shenderyuk, et al., 1990 | 50. m/0.30 mm/0.40 μm, He |

Van Den Dool and Kratz RI, non-polar column, temperature ramp

Column type | Active phase | I | Reference | Comment |
---|---|---|---|---|
Capillary | BP-5 | 919. | Whitfield and Mottram, 2001 | 4. K/min; Column length: 50. m; Column diameter: 0.32 mm; Tstart: 60. C; Tend: 250. C |

Normal alkane RI, non-polar column, temperature ramp

Column type | Active phase | I | Reference | Comment |
---|---|---|---|---|
Capillary | Methyl Silicone | 900. | Lorenz, Stern, et al., 1983 | 4. K/min, 200. C @ 15. min; Column length: 25. m; Column diameter: 0.2 mm; Tstart: 50. C |

Normal alkane RI, non-polar column, custom temperature program

Column type | Active phase | I | Reference | Comment |
---|---|---|---|---|
Capillary | SE-30 | 900. | Vinogradov, 2004 | Program: not specified |

Normal alkane RI, polar column, custom temperature program

Column type | Active phase | I | Reference | Comment |
---|---|---|---|---|
Capillary | Carbowax 20M | 1231. | Vinogradov, 2004 | Program: not specified |
Capillary | Carbowax | 1242. | Baltes and Bochmann, 1987 | Program: not specified |
Capillary | Carbowax | 1244. | Baltes and Bochmann, 1987 | Program: not specified |

References

Golovnya, Zhuravleva, et al., 1991
Golovnya, R.V.; Zhuravleva, I.L.; Yakush, E.V.; Schenderjuk, V.V.,
Retentions of alkyloxazoles and alkythiazoles and their prediction based on non-linear additivity concepts in gas chromatography,
J. Chromatogr., 1991, 552, 1-12, https://doi.org/10.1016/S0021-9673(01)95918-7
. [all data]
Zhuravleva, Shenderyuk, et al., 1990
Zhuravleva, I.L.; Shenderyuk, V.V.; Yakush, E.V.; Golovnya, R.V.,
Calculation of retention indexes of alkyloxazoles and alkylthiazoles in capillary chromatography,
Bull. Acad. Sci. USSR, Div. Chem. Sci. (Engl. Transl.), 1990, 6, 6, 1204-1210, https://doi.org/10.1007/BF00962384
. [all data]
Whitfield and Mottram, 2001
Whitfield, F.B.; Mottram, D.S.,
Heterocyclic volatiles formed by heating cysteine or hydrogen sulfide with 4-hydroxy-5-methyl-3(2H)-furanone at pH 6.5,
J. Agric. Food Chem., 2001, 49, 2, 816-822, https://doi.org/10.1021/jf0008644
. [all data]
Lorenz, Stern, et al., 1983
Lorenz, G.; Stern, D.J.; Flath, R.A.; Haddon, W.F.; Tillin, S.J.; Teranishi, R.,
Identification of sheep liver volatiles,
J. Agric. Food Chem., 1983, 31, 5, 1052-1057, https://doi.org/10.1021/jf00119a033
. [all data]
Vinogradov, 2004
Vinogradov, B.A.,
Production, composition, properties and application of essential oils, 2004, retrieved from http://viness.narod.ru. [all data]
Baltes and Bochmann, 1987
Baltes, W.; Bochmann, G.,
Model reactions on roast aroma formations, V. Mass spectrometric identification of pyrifines, oxazoles, and carbocyclic compounds from the reaction of serine and threonine with sucrose under the conditions of coffee roasting,
Z. Lebensm. Unters. Forsch., 1987, 185, 1, 5-9, https://doi.org/10.1007/BF01083331
. [all data]