Desmethylclomipramine
- Formula: C18H21ClN2
- Molecular weight: 300.826
- IUPAC Standard InChIKey: VPIXQGUBUKFLRF-UHFFFAOYSA-N
- CAS Registry Number: 303-48-0
- Chemical structure:
View 3d structure (requires JavaScript / HTML 5) - Other names: Norclomipramine; N-Desmethylclomipramine; 3-(3-Chloro-10,11-dihydro-5H-dibenzo[b,f]azepin-5-yl)-N-methyl-1-propanamine

Van Den Dool and Kratz RI, non-polar column, temperature ramp

Column type | Active phase | I | Reference | Comment |
---|---|---|---|---|
Capillary | VF-5MS | 2516.6 | Tretyakov, 2014 | 30. m/0.25 mm/0.25 μm, He; Tstart: 60. C; Tend: 270. C |

References

Tretyakov, 2014
Tretyakov, K.V.,
Retention Data. NIST Mass Spectrometry Data Center., NIST Mass Spectrometry Data Center, 2014. [all data]