Bis(2-(Dimethylamino)ethyl) ether
- Formula: C8H20N2O
- Molecular weight: 160.2572
- IUPAC Standard InChIKey: GTEXIOINCJRBIO-UHFFFAOYSA-N
- CAS Registry Number: 3033-62-3
- Chemical structure:

Phase change data

Data compiled by: Robert L. Brown and Stephen E. Stein
Reduced pressure boiling point
Tboil (K) | Pressure (bar) | Reference |
---|---|---|
353. | 0.020 | American Tokyo Kasei, 1988 |

References

American Tokyo Kasei, 1988
American Tokyo Kasei,
TCI American Organic Chemical 88/89 Catalog, American Tokyo Kasei, Portland, OR, 1988, 1610. [all data]