1,3-Propanediol, 2-methyl-2-[(nitrooxy)methyl]-, dinitrate (ester)
- Formula: C5H9N3O9
- Molecular weight: 255.1397
- IUPAC Standard InChIKey: IPPYBNCEPZCLNI-UHFFFAOYSA-N
- CAS Registry Number: 3032-55-1
- Chemical structure:
View 3d structure (requires JavaScript / HTML 5) - Other names: 1,3-Propanediol, 2-(hydroxymethyl)-2-methyl-, trinitrate; Metriol trinitrate; Trimethylolethane trinitrate; Tris(hydroxymethyl)ethane trinitrate; TMETN; 1,1,1-Trimethylolethane trinitrate; 2-Methyl-2-hydroxymethyl-1,3-propanediol trinitrate; 2-Methyl-2-nitro-oxymethyltrimethylene dinitrate; 1,3-Propanediol, 2-methyl-2-[(nitrooxy)methyl]-, dinitrate; 2-Methyl-2-[(nitrooxy)methyl]propane-1,3-diyl dinitrate

Condensed phase thermochemistry data

Data compiled by: Hussein Y. Afeefy, Joel F. Liebman, and Stephen E. Stein
Quantity | Value | Units | Method | Reference | Comment |
---|---|---|---|---|---|
ΔcH°liquid | -2811. | kJ/mol | Ccb | Handrick, 1956 | W. R. Tomlinson 1949 |
Quantity | Value | Units | Method | Reference | Comment |
ΔfH°solid | -450.2 | kJ/mol | Ccb | Tavernier, 1956 |

Phase change data

Data compiled as indicated in comments:
ALS - Hussein Y. Afeefy, Joel F. Liebman, and Stephen E. Stein
AC - William E. Acree, Jr., James S. Chickos
Quantity | Value | Units | Method | Reference | Comment |
---|---|---|---|---|---|
ΔvapH° | 88.2 ± 0.1 | kJ/mol | V | Woodman and Adicoff, 1963 | ALS |
Enthalpy of vaporization
ΔvapH (kJ/mol) | Temperature (K) | Method | Reference | Comment |
---|---|---|---|---|
88.1 | 314. | A | Stephenson and Malanowski, 1987 | Based on data from 299. to 345. K.; AC |

Kovats' RI, non-polar column, temperature ramp

Column type | Active phase | I | Reference | Comment |
---|---|---|---|---|
Packed | OV-101 | 1529. | Alley and Dykes, 1972 | 6. K/min; Tstart: 70. C; Tend: 220. C |

References

Handrick, 1956
Handrick, G.R.,
Report of the study of pure explosive compounds. Part IV. Calculation of heat of combustion of organic compounds from structural features and calculation of power of high explosives, Rpt. C-58247 for the Office of the Chief of Ordnance, contract DA-19-020-ORD-47 by the Arthur D. Little, Inc., Cambridge, MA, 1956, 467-573. [all data]
Tavernier, 1956
Tavernier, P.,
Donnees thermochimiques relatives aux constituants des poudres,
Mem. Poudres, 1956, 301-327. [all data]
Woodman and Adicoff, 1963
Woodman, A.L.; Adicoff, A.,
Vapor pressure of triacetin, triethylene glycol dinitrte, and metriol trinitrate,
J. Chem. Eng. Data, 1963, 8, 241-242. [all data]
Stephenson and Malanowski, 1987
Stephenson, Richard M.; Malanowski, Stanislaw,
Handbook of the Thermodynamics of Organic Compounds, 1987, https://doi.org/10.1007/978-94-009-3173-2
. [all data]
Alley and Dykes, 1972
Alley, B.J.; Dykes, H.W.H.,
Gas-Liquid Chromatographic Determination of Nitrate Esters,Stabilizers and Plasticizers in Nitrocellulose-Base Propellants,
J. Chromatogr., 1972, 71, 1, 23-37, https://doi.org/10.1016/S0021-9673(01)85687-9
. [all data]