Pentane, 2-bromo-4-methyl-
- Formula: C6H13Br
- Molecular weight: 165.071
- IUPAC Standard InChIKey: IUXIOXCOPJFKMQ-UHFFFAOYSA-N
- CAS Registry Number: 30310-22-6
- Chemical structure:
View 3d structure (requires JavaScript / HTML 5) - Other names: 2-Bromo-4-methylpentane

Phase change data

Data compiled as indicated in comments:
BS - Robert L. Brown and Stephen E. Stein
TRC - Thermodynamics Research Center, NIST Boulder Laboratories, Chris Muzny director
AC - William E. Acree, Jr., James S. Chickos
Quantity | Value | Units | Method | Reference | Comment |
---|---|---|---|---|---|
Tboil | 403. to 406. | K | N/A | Frinton Laboratories Inc., 1986 | BS |
Quantity | Value | Units | Method | Reference | Comment |
Tfus | 179.15 | K | N/A | Timmermans, 1952 | Uncertainty assigned by TRC = 1.5 K; TRC |
Tfus | 178.6 | K | N/A | Van Risseghem, 1933 | Uncertainty assigned by TRC = 1.5 K; TRC |
Enthalpy of vaporization
ΔvapH (kJ/mol) | Temperature (K) | Method | Reference | Comment |
---|---|---|---|---|
29.3 | 330. | A | Stephenson and Malanowski, 1987 | Based on data from 315. to 448. K. See also Dykyj, 1972.; AC |

Kovats' RI, non-polar column, isothermal

Column type | Active phase | Temperature (C) | I | Reference | Comment |
---|---|---|---|---|---|
Packed | Apiezon L | 100. | 935. | Castello and D'Amato, 1985 | He, Chromosorb W AW DMCS; Column length: 3. m |
Packed | Apiezon L | 125. | 950. | Castello and D'Amato, 1985 | He, Chromosorb W AW DMCS; Column length: 3. m |
Packed | Apiezon L | 75. | 917. | Castello and D'Amato, 1985 | He, Chromosorb W AW DMCS; Column length: 3. m |

Kovats' RI, polar column, isothermal

Column type | Active phase | Temperature (C) | I | Reference | Comment |
---|---|---|---|---|---|
Packed | Carbowax 20M | 125. | 1037. | Castello and D'Amato, 1985 | He, Chromosorb W AW DMCS; Column length: 3. m |
Packed | Carbowax 20M | 75. | 1003. | Castello and D'Amato, 1985 | He, Chromosorb W AW DMCS; Column length: 3. m |

Normal alkane RI, non-polar column, isothermal

Column type | Active phase | Temperature (C) | I | Reference | Comment |
---|---|---|---|---|---|
Capillary | Apiezon L | 130. | 940. | Arruda, Junkes, et al., 2008 |

References

Frinton Laboratories Inc., 1986
Frinton Laboratories Inc.,
Catalog Number 11, Frinton Laboratories Inc., Vineland, NJ, 1986, 99. [all data]
Timmermans, 1952
Timmermans, J.,
Freezing points of organic compounds. VVI New determinations.,
Bull. Soc. Chim. Belg., 1952, 61, 393. [all data]
Van Risseghem, 1933
Van Risseghem, H.,
4-methyl-1-pentene and some of its derivatives.,
Bull. Soc. Chim. Belg., 1933, 42, 229-37. [all data]
Stephenson and Malanowski, 1987
Stephenson, Richard M.; Malanowski, Stanislaw,
Handbook of the Thermodynamics of Organic Compounds, 1987, https://doi.org/10.1007/978-94-009-3173-2
. [all data]
Dykyj, 1972
Dykyj, J.,
Petrochemia, 1972, 12, 1, 13. [all data]
Castello and D'Amato, 1985
Castello, G.; D'Amato, G.,
Gas Chromatography Separation and Identification of Linear and Branched-Chain Alkyl Bromides,
J. Chromatogr., 1985, 324, 363-371, https://doi.org/10.1016/S0021-9673(01)81335-2
. [all data]
Arruda, Junkes, et al., 2008
Arruda, A.C.S.; Junkes, B. da.S.; Souza, E.S.; Yunes, R.A.; Heizen, V.E.F.,
Semi-Emlirical Topological Index to Predict Properties of Halogenated Aliphatic Compounds,
J. Chemometrics, 2008, 22, 3-4, 186-194, https://doi.org/10.1002/cem.1121
. [all data]