1,8-Diphenyl-1,3,5,7-octatetraene
- Formula: C20H18
- Molecular weight: 258.3569
- IUPAC Standard InChIKey: ZENGMMQJMCPHTK-AIQSGNSHSA-N
- CAS Registry Number: 3029-40-1
- Chemical structure:
View 3d structure (requires JavaScript / HTML 5) - Stereoisomers:
- Other names: Benzene, 1,1'-(1,3,5,7-octatetraene-1,8-diyl)bis-; α,ω-Diphenyloctatetraene; 1,3,5,7-Octatetraene, 1,8-diphenyl-; 1,8-Diphenyloctatetraene; 8-Phenyl-1,3,5,7-octatetraenyl]benzene; 1,8-diphenylocta-1,3,5,7-tetraene

Phase change data

Data compiled by: Thermodynamics Research Center, NIST Boulder Laboratories, Chris Muzny director
Quantity | Value | Units | Method | Reference | Comment |
---|---|---|---|---|---|
Tfus | 505. | K | N/A | DeTar and Weis, 1956 | Uncertainty assigned by TRC = 4. K |
Tfus | 505.3 | K | N/A | Sangster and Irvine, 1956 | Uncertainty assigned by TRC = 4. K |
Tfus | 508. | K | N/A | Zechmeister and Pinckard, 1954 | Uncertainty assigned by TRC = 5. K; configuration: all trans |
Tfus | 413. | K | N/A | Zechmeister and Pinckard, 1954 | Uncertainty assigned by TRC = 5. K; configuration: posoition 3 cis, all others trans |

References

DeTar and Weis, 1956
DeTar, D.F.; Weis, C.,
The products of the thermal decomposition of Bis-δ-phenylvaleryl peroxide in carbon tetrachloride and in benzene,
J. Am. Chem. Soc., 1956, 78, 4296. [all data]
Sangster and Irvine, 1956
Sangster, R.C.; Irvine, J.W.,
Study of Organic Scintillators,
J. Chem. Phys., 1956, 24, 670. [all data]
Zechmeister and Pinckard, 1954
Zechmeister, L.; Pinckard, J.H.,
J. Am. Chem. Soc., 1954, 76, 4144. [all data]