dl-Alanine
- Formula: C3H7NO2
- Molecular weight: 89.0932
- IUPAC Standard InChIKey: QNAYBMKLOCPYGJ-UHFFFAOYSA-N
- CAS Registry Number: 302-72-7
- Chemical structure:
View 3d structure (requires JavaScript / HTML 5) - Species with the same structure:
- Stereoisomers:
- Other names: (.+/-.)-Alanine; dl-α-Aminopropionic acid; dl-2-Aminopropanoic acid; Alanine, DL-; ALANINE, α; DL-α-Alanine

Condensed phase thermochemistry data

Data compiled as indicated in comments:
ALS - Hussein Y. Afeefy, Joel F. Liebman, and Stephen E. Stein
DH - Eugene S. Domalski and Elizabeth D. Hearing
Quantity | Value | Units | Method | Reference | Comment |
---|---|---|---|---|---|
ΔfH°solid | -578.9 ± 2.9 | kJ/mol | Ccb | Contineanu and Marchidan, 1984 | ALS |
ΔfH°solid | -563.63 ± 0.59 | kJ/mol | Ccb | Huffman, Fox, et al., 1937 | Author's hf298=-135.26 kcal/mol; ALS |
Quantity | Value | Units | Method | Reference | Comment |
ΔcH°solid | -1602. ± 2.9 | kJ/mol | Ccb | Contineanu and Marchidan, 1984 | ALS |
ΔcH°solid | -1617.3 ± 0.59 | kJ/mol | Ccb | Huffman, Fox, et al., 1937 | Author's hf298=-135.26 kcal/mol; ALS |
ΔcH°solid | -1623.4 ± 0.2 | kJ/mol | Ccb | Wrede, 1911 | ALS |
ΔcH°solid | -1633.6 | kJ/mol | Ccb | Fischer and Wrede, 1904 | Heat of combustion corrected for pressure; ALS |
Quantity | Value | Units | Method | Reference | Comment |
S°solid,1 bar | 132.2 | J/mol*K | N/A | Huffman and Ellis, 1937 | Extrapolation below 90 K, 36.99 J/mol*K.; DH |
Constant pressure heat capacity of solid
Cp,solid (J/mol*K) | Temperature (K) | Reference | Comment |
---|---|---|---|
114. | 298. | Badelin, Kulikov, et al., 1990 | T = 298, 313, 333, 348 K.; DH |
113.8 | 298. | Kulikov, Kozlov, et al., 1989 | T = 298 to 348 K.; DH |
121.6 | 298.15 | Spink and Wads, 1975 | DH |
121.71 | 297.5 | Huffman and Ellis, 1937 | T = 85 to 298 K. Value is unsmoothed experimental datum.; DH |

References

Contineanu and Marchidan, 1984
Contineanu, I.; Marchidan, D.I.,
The enthalpies of combustion and formation of D-alanine, L-alanine, DL-alanine, and β-alanine,
Rev. Roum. Chim., 1984, 29, 43-48. [all data]
Huffman, Fox, et al., 1937
Huffman, H.M.; Fox, S.W.; Ellis, E.L.,
Thermal data. VII. The heats of combustion of seven amino acids,
J. Am. Chem. Soc., 1937, 59, 2144-21. [all data]
Wrede, 1911
Wrede, F.,
Uber die Bestimmung von Berbrennungswarmen mittels der kalorimetrischen Bombe unter Benutzung des Platinwiderstandsthermometers,
Z. Phys. Chem. (Leipzig), 1911, 81-94. [all data]
Fischer and Wrede, 1904
Fischer, E.; Wrede, F.,
Uber die Verbrennungswarme einiger organischer Verbindungen,
Sitzungsber. Dtsch. Akad. Wiss. Berlin Kl. Math. Phys. Tech., 1904, 687-715. [all data]
Huffman and Ellis, 1937
Huffman, H.M.; Ellis, E.L.,
Thermal data. VIII. The heat capacities, entropies and free energies of some amino acids,
J. Am. Chem. Soc., 1937, 59, 2150-2152. [all data]
Badelin, Kulikov, et al., 1990
Badelin, V.G.; Kulikov, O.V.; Batagin, V.S.; Udzig, E.; Zielenkiewicz, A.; Zielenkiewicz, W.; Krestov, G.A.,
Physico-chemical properties of peptides and their solutions,
Thermochim. Acta, 1990, 169, 81-93. [all data]
Kulikov, Kozlov, et al., 1989
Kulikov, O.V.; Kozlov, V.A.; Malenkina, L.I.; Badelin, V.G.,
Heat capacities of amino acids and peptides and excess characteristics ot their aqueous solutions, Sbornik Nauch. Trud., Termodin. Rast. neelect., Ivanovo,
Inst. nevod. rast., 1989, Akad. [all data]
Spink and Wads, 1975
Spink, C.H.; Wads, I.,
Thermochemistry of solutions of biochemical model compounds. 4. The partial molar heat capacities of some amino acids in aqueous solution,
J. Chem. Thermodynam., 1975, 7, 561-572. [all data]