N,N-diethyl-4-[(4-nitrophenyl)azo]aniline
- Formula: C16H18N4O2
- Molecular weight: 298.3397
- IUPAC Standard InChIKey: LVQIWDUSUJTZJF-ISLYRVAYSA-N
- CAS Registry Number: 3025-52-3
- Chemical structure:
View 3d structure (requires JavaScript / HTML 5) - Other names: 4-(N,N-diethylamino)-4'-nitroazobenzene

Phase change data

Data compiled by: William E. Acree, Jr., James S. Chickos
Enthalpy of sublimation
ΔsubH (kJ/mol) | Temperature (K) | Method | Reference | Comment |
---|---|---|---|---|
151.5 ± 4.2 | 431. | ME | Bradley, Bird, et al., 1960 | Based on data from 422. to 441. K. |

References

Bradley, Bird, et al., 1960
Bradley, R.S.; Bird, C.L.; Jones, F.,
The vapour pressures and heats of sublimation of some disperse dyes,
Trans. Faraday Soc., 1960, 56, 23, https://doi.org/10.1039/tf9605600023
. [all data]