Naphthalene, 1,2,3,4-tetrahydro-1-phenyl-
- Formula: C16H16
- Molecular weight: 208.2982
- IUPAC Standard InChIKey: YSPDISPRPJFBCV-UHFFFAOYSA-N
- CAS Registry Number: 3018-20-0
- Chemical structure:
View 3d structure (requires JavaScript / HTML 5) - Other names: 1-Phenyl-1,2,3,4-tetrahydronaphthalene; 1-Phenyltetralin; 1,2,3,4-Tetrahydro-1-phenylnaphthalene

Van Den Dool and Kratz RI, non-polar column, temperature ramp

Column type | Active phase | I | Reference | Comment |
---|---|---|---|---|
Capillary | Petrocol DH | 1740. | White, Hackett, et al., 1992 | 100. m/0.25 mm/0.5 μm, He, 1. K/min; Tstart: 30. C; Tend: 220. C |

Normal alkane RI, non-polar column, temperature ramp

Column type | Active phase | I | Reference | Comment |
---|---|---|---|---|
Packed | SE-30 | 1720. | Khudobina and Zenkevich, 1984 | Helium, Chromosorb W (80-100 mesh), 50. C @ 0. min, 5. K/min, 250. C @ 0. min; Column length: 1.8 m |

References

White, Hackett, et al., 1992
White, C.M.; Hackett, J.; Anderson, R.R.; Kail, S.; Spock, P.S.,
Linear temperature programmed retention indices of gasoline range hydrocarbons and chlorinated hydrocarbons on cross-linked polydimethylsiloxane,
J. Hi. Res. Chromatogr., 1992, 15, 2, 105-120, https://doi.org/10.1002/jhrc.1240150211
. [all data]
Khudobina and Zenkevich, 1984
Khudobina, G.V.; Zenkevich, I.G.,
Chromato Mass Spectrometric Identification of Dimers in Recycled Styrene, VINITI, # 8039-84, 1984, 14. [all data]