Propane, 2-bromo-1-chloro-
- Formula: C3H6BrCl
- Molecular weight: 157.437
- IUPAC Standard InChIKey: PUJJZGFFAQHYEX-UHFFFAOYSA-N
- CAS Registry Number: 3017-95-6
- Chemical structure:
View 3d structure (requires JavaScript / HTML 5) - Other names: 1-Chloro-2-bromopropane; 2-Bromo-1-chloropropane

Phase change data

Data compiled by: Robert L. Brown and Stephen E. Stein
Quantity | Value | Units | Method | Reference | Comment |
---|---|---|---|---|---|
Tboil | 389.7 | K | N/A | Aldrich Chemical Company Inc., 1990 |
Reduced pressure boiling point
Tboil (K) | Pressure (bar) | Reference |
---|---|---|
391.2 | 1.01 | Weast and Grasselli, 1989 |
391. | 1.01 | Buckingham and Donaghy, 1982 |

Reaction thermochemistry data

Data compiled by: Hussein Y. Afeefy, Joel F. Liebman, and Stephen E. Stein
Individual Reactions
By formula: C3H6BrCl = HBr + C3H5Cl
Quantity | Value | Units | Method | Reference | Comment |
---|---|---|---|---|---|
ΔrH° | 75.4 | kJ/mol | Eqk | Levanova, Rodova, et al., 1983 | liquid phase; Flow reactor |
By formula: C3H6BrCl = C3H5Br + HCl
Quantity | Value | Units | Method | Reference | Comment |
---|---|---|---|---|---|
ΔrH° | 64.9 | kJ/mol | Eqk | Levanova, Rodova, et al., 1983 | liquid phase; Flow reactor |
By formula: 2C3H6BrCl = C3H6Br2 + C3H6Cl2
Quantity | Value | Units | Method | Reference | Comment |
---|---|---|---|---|---|
ΔrH° | 9.2 | kJ/mol | Eqk | Levanova, Rodova, et al., 1983 | liquid phase; Flow reactor |

Van Den Dool and Kratz RI, non-polar column, temperature ramp

Column type | Active phase | I | Reference | Comment |
---|---|---|---|---|
Capillary | DB-1 | 743.6 | Sun and Stremple, 2003 | 30. m/0.25 mm/0.25 μm, He, 3. K/min; Tstart: 40. C; Tend: 325. C |

Normal alkane RI, non-polar column, custom temperature program

Column type | Active phase | I | Reference | Comment |
---|---|---|---|---|
Capillary | OV-1, SE-30, Methyl silicone, SP-2100, OV-101, DB-1, etc. | 747. | Waggott and Davies, 1984 | Hydrogen; Column length: 50. m; Column diameter: 0.32 mm; Program: not specified |

References

Aldrich Chemical Company Inc., 1990
Aldrich Chemical Company Inc.,
Catalog Handbook of Fine Chemicals, Aldrich Chemical Company, Inc., Milwaukee WI, 1990, 1. [all data]
Weast and Grasselli, 1989
CRC Handbook of Data on Organic Compounds, 2nd Editon, Weast,R.C and Grasselli, J.G., ed(s)., CRC Press, Inc., Boca Raton, FL, 1989, 1. [all data]
Buckingham and Donaghy, 1982
Buckingham, J.; Donaghy, S.M.,
Dictionary of Organic Compounds: Fifth Edition, Chapman and Hall, New York, 1982, 1. [all data]
Levanova, Rodova, et al., 1983
Levanova, S.V.; Rodova, R.M.; Tereshkina, T.P.; Zabrodina, T.I.,
Thermocatalytic reactions of bromochloropropanes,
Russ. J. Phys. Chem. (Engl. Transl.), 1983, 57, 1142-1146. [all data]
Sun and Stremple, 2003
Sun, G.; Stremple, P.,
Retention index characterization of flavor, fragrance, and many other compounds on DB-1 and DB-XLB, 2003, retrieved from http://www.chem.agilent.com/cag/cabu/pdf/b-0279.pdf. [all data]
Waggott and Davies, 1984
Waggott, A.; Davies, I.W.,
Identification of organic pollutants using linear temperature programmed retention indices (LTPRIs) - Part II, 1984, retrieved from http://dwi.defra.gov.uk/research/completed-research/reports/dwi0383.pdf. [all data]