2-bromo-3-methyl-2-butene
- Formula: C5H9Br
- Molecular weight: 149.029
- IUPAC Standard InChIKey: DBELOSOZLGEZBM-UHFFFAOYSA-N
- CAS Registry Number: 3017-70-7
- Chemical structure:
View 3d structure (requires JavaScript / HTML 5) - Permanent link for this species. Use this link for bookmarking this species for future reference.

Phase change data

Data compiled by: Thermodynamics Research Center, NIST Boulder Laboratories, Chris Muzny director
Quantity | Value | Units | Method | Reference | Comment |
---|---|---|---|---|---|
Tboil | 391.65 | K | N/A | Bourguel and Piaux, 1932 | Uncertainty assigned by TRC = 2. K |

Reaction thermochemistry data

Data compiled by: Hussein Y. Afeefy, Joel F. Liebman, and Stephen E. Stein
Individual Reactions
By formula: C5H10Br2 = HBr + C5H9Br
Quantity | Value | Units | Method | Reference | Comment |
---|---|---|---|---|---|
ΔrH° | 74. ± 2. | kJ/mol | Eqk | Meged, Levanova, et al., 1980 | gas phase |

References

Bourguel and Piaux, 1932
Bourguel, M.; Piaux, L.,
Raman Effect in Chemistry. Allenic Hydrocarbons. Study and Preparation of 1,1-Dimethylallene,
Bull. Soc. Chim. Fr., 1932, 51, 1041. [all data]
Meged, Levanova, et al., 1980
Meged, V.M.; Levanova, S.V.; Rozhnov, A.M.,
Dehydrohalogenation of dihalomethylbutanes. 2.,
Izv. Vyssh. Uchebn. Zaved., Khim. Khim. Tekhnol., 1980, 23, 149-151. [all data]