trans 2-bromo-2-butene
- Formula: C4H7Br
- Molecular weight: 135.002
- IUPAC Standard InChIKey: UILZQFGKPHAAOU-ARJAWSKDSA-N
- CAS Registry Number: 3017-68-3
- Chemical structure:
View 3d structure (requires JavaScript / HTML 5) - Species with the same structure:
- Stereoisomers:

Phase change data

Data compiled as indicated in comments:
TRC - Thermodynamics Research Center, NIST Boulder Laboratories, Chris Muzny director
AC - William E. Acree, Jr., James S. Chickos
Quantity | Value | Units | Method | Reference | Comment |
---|---|---|---|---|---|
Tboil | 358.95 | K | N/A | Timmermans, 1927 | Uncertainty assigned by TRC = 0.5 K; source of data not clear; TRC |
Quantity | Value | Units | Method | Reference | Comment |
Tfus | 161.95 | K | N/A | Timmermans, 1927 | Uncertainty assigned by TRC = 0.5 K; TRC |
Enthalpy of vaporization
ΔvapH (kJ/mol) | Temperature (K) | Method | Reference | Comment |
---|---|---|---|---|
35.7 | 243. | A | Stephenson and Malanowski, 1987 | Based on data from 228. to 359. K. See also Stull, 1947.; AC |

Reaction thermochemistry data

Data compiled by: Hussein Y. Afeefy, Joel F. Liebman, and Stephen E. Stein

Individual Reactions

trans-2-Bromo-2-butene = trans 2-bromo-2-butene

By formula: C4H7Br = C4H7Br

Quantity Value Units Method Reference Comment
Δr-6.276kJ/molEqkSharonov, Rozhnov, et al., 1975gas phase

References

Timmermans, 1927
Timmermans, J.,
The Melting Point of Organic Substances,
Bull. Soc. Chim. Belg., 1927, 36, 502. [all data]
Stephenson and Malanowski, 1987
Stephenson, Richard M.; Malanowski, Stanislaw,
Handbook of the Thermodynamics of Organic Compounds, 1987, https://doi.org/10.1007/978-94-009-3173-2
. [all data]
Stull, 1947
Stull, Daniel R.,
Vapor Pressure of Pure Substances. Organic and Inorganic Compounds,
Ind. Eng. Chem., 1947, 39, 4, 517-540, https://doi.org/10.1021/ie50448a022
. [all data]