Terephthalamide
- Formula: C8H8N2O2
- Molecular weight: 164.1613
- IUPAC Standard InChIKey: MHSKRLJMQQNJNC-UHFFFAOYSA-N
- CAS Registry Number: 3010-82-0
- Chemical structure:
View 3d structure (requires JavaScript / HTML 5) - Other names: p-Carbamoylbenzamide; p-Phthalamide; Terephthalamimidic acid; Terephthaldiamide; Terephthalic acid diamide; Terephthalic diamide; 1,4-Benzenedicarboxamide

Gas phase thermochemistry data

Data compiled as indicated in comments:
ALS - Hussein Y. Afeefy, Joel F. Liebman, and Stephen E. Stein
Quantity | Value | Units | Method | Reference | Comment |
---|---|---|---|---|---|
ΔfH°gas | -292. | kJ/mol | Semi | Stewart, 2004 | |
ΔfH°gas | -376. ± 4.2 | kJ/mol | Ccb | Hamilton and Witt, 1972 | ALS |

Condensed phase thermochemistry data

Data compiled by: Hussein Y. Afeefy, Joel F. Liebman, and Stephen E. Stein
Quantity | Value | Units | Method | Reference | Comment |
---|---|---|---|---|---|
ΔfH°solid | -433.1 ± 1.3 | kJ/mol | Ccb | Hamilton and Witt, 1972 | |
Quantity | Value | Units | Method | Reference | Comment |
ΔcH°solid | -3858.3 ± 1.2 | kJ/mol | Ccb | Hamilton and Witt, 1972 |

Phase change data

Data compiled as indicated in comments:
ALS - Hussein Y. Afeefy, Joel F. Liebman, and Stephen E. Stein
AC - William E. Acree, Jr., James S. Chickos
Quantity | Value | Units | Method | Reference | Comment |
---|---|---|---|---|---|
ΔsubH° | 57.3 ± 4.2 | kJ/mol | V | Hamilton and Witt, 1972 | ALS |
Enthalpy of sublimation
ΔsubH (kJ/mol) | Temperature (K) | Reference | Comment |
---|---|---|---|
57.3 ± 4.2 | 373. to 498. | Hamilton and Witt, 1972 | AC |

References

Stewart, 2004
Stewart, J.J.P.,
Comparison of the accuracy of semiempirical and some DFT methods for predicting heats of formation,
J. Mol. Model, 2004, 10, 1, 6-10, https://doi.org/10.1007/s00894-003-0157-6
. [all data]
Hamilton and Witt, 1972
Hamilton, W.S.; Witt, L.C.,
Heat of combustion of terephthalamide,
J. Chem. Eng. Data, 1972, 17, 138-139. [all data]