9-Octadecenamide, (Z)-
- Formula: C18H35NO
- Molecular weight: 281.4766
- IUPAC Standard InChIKey: FATBGEAMYMYZAF-KTKRTIGZSA-N
- CAS Registry Number: 301-02-0
- Chemical structure:
View 3d structure (requires JavaScript / HTML 5) - Stereoisomers:
- Other names: Adogen 73; Oleamide; Oleic acid amide; Oleyl amide; Slip-eze; Armoslip CP; Crodamide O; Crodamide OR; Amide O; Diamide O 200; Diamid O 200; (Z)-9-Octadecenamide; Armid O; cis-9,10-Octadecenoamide; Kemamide O; Petrac Slip-Eze; Unislip 1759; 9-Octadecenamide, cis-; 9-Octadecenamide, (9Z)-

Phase change data

Data compiled by: Thermodynamics Research Center, NIST Boulder Laboratories, Chris Muzny director
Quantity | Value | Units | Method | Reference | Comment |
---|---|---|---|---|---|
Tfus | 349.05 | K | N/A | Mod, Magne, et al., 1960 | Uncertainty assigned by TRC = 0.3 K |

Normal alkane RI, non-polar column, custom temperature program

Column type | Active phase | I | Reference | Comment |
---|---|---|---|---|
Capillary | HP-5 | 2375. | Zhao, Li, et al., 2008 | 30. m/0.25 mm/0.25 μm; Program: 40 0C (2 min) 5 0C/min -> 80 0C 7 oC/min -> 160 0C 9 0C/min -> 200 0C 20 0C/min -> 280 0C (10 min) |
Capillary | HP-5 | 2397. | Yasar, Üçüncü, et al., 2005 | 30. m/0.25 mm/0.25 μm, He; Program: 60C(5min) => 3C/min => 120C (2min) => 2C/min => 200C (2min) => 3C/min => 320C |

Normal alkane RI, polar column, temperature ramp

Column type | Active phase | I | Reference | Comment |
---|---|---|---|---|
Capillary | TC-WAX FFS | 3265. | Miyazawa, Maehara, et al., 2002 | He, 3. K/min; Column length: 60. m; Column diameter: 0.25 mm; Tstart: 60. C; Tend: 240. C |

References

Mod, Magne, et al., 1960
Mod, R.R.; Magne, F.C.; Skau, E.L.,
Pure Acid-Free Amides of C18 Fatty Acids. Their Preparation and Binary Freezing Point Behavior,
J. Chem. Eng. Data, 1960, 5, 478. [all data]
Zhao, Li, et al., 2008
Zhao, Y.; Li, J.; Xu, Y.; Duan, H.; Fan, W.; Zhao, G.,
EXtraction, preparation and identification of volatile compounds in Changyu XO brandy,
Chinese J. Chromatogr., 2008, 26, 2, 212-222, https://doi.org/10.1016/S1872-2059(08)60014-0
. [all data]
Yasar, Üçüncü, et al., 2005
Yasar, A.; Üçüncü, O.; Güleç, C.; Inceer, H.; Ayaz, S.; Yayh, N.,
GC-MS analysis of chloroform extracts in flowers, stems, and roots of Tripleurospermum callosum,
Pharm. Biol., 2005, 43, 2, 108-112, https://doi.org/10.1080/13880200590919384
. [all data]
Miyazawa, Maehara, et al., 2002
Miyazawa, M.; Maehara, T.; Kurose, K.,
Composition of the essential oil from the leaves of Eruca sativa,
Flavour Fragr. J., 2002, 17, 3, 187-190, https://doi.org/10.1002/ffj.1079
. [all data]