9,12,15-Octadecatrienoic acid, methyl ester, (Z,Z,Z)-
- Formula: C19H32O2
- Molecular weight: 292.4562
- IUPAC Standard InChIKey: DVWSXZIHSUZZKJ-YSTUJMKBSA-N
- CAS Registry Number: 301-00-8
- Chemical structure:
View 3d structure (requires JavaScript / HTML 5) - Stereoisomers:
- Other names: Linolenic acid, methyl ester; Methyl all-cis-9,12,15-octadecatrienoate; Methyl linolenate; cis,cis,cis-9,12,15-Octadecatrienoic acid, methyl ester; Methyl α-linolenate; Methyl linolenate, α; (Z,Z,Z)-9,12,15-Octadecatrienoic acid, methyl ester; [Z,Z,Z]-9,12,15-Octadecadienoic acid methyl ester; methyl (9Z,12Z,15Z)-9,12,15-octadecatrienoate

Condensed phase thermochemistry data

Data compiled by: Hussein Y. Afeefy, Joel F. Liebman, and Stephen E. Stein
Quantity | Value | Units | Method | Reference | Comment |
---|---|---|---|---|---|
ΔfH°liquid | -492.75 | kJ/mol | Chyd | Rogers and Siddiqui, 1975 | |
Quantity | Value | Units | Method | Reference | Comment |
ΔcH°liquid | -11506.0 ± 1.5 | kJ/mol | Ccb | Freedman, Bagby, et al., 1989 | Corresponding ΔfHºliquid = -543.96 kJ/mol (simple calculation by NIST; no Washburn corrections) |

Phase change data

Data compiled as indicated in comments:
BS - Robert L. Brown and Stephen E. Stein
AC - William E. Acree, Jr., James S. Chickos
Quantity | Value | Units | Method | Reference | Comment |
---|---|---|---|---|---|
ΔvapH° | 110.5 ± 0.5 | kJ/mol | CGC | Lipkind, Kapustin, et al., 2007 | AC |
ΔvapH° | 102.1 | kJ/mol | GC | Krop, Velzen, et al., 1997 | Based on data from 423. to 503. K.; AC |
Reduced pressure boiling point
Tboil (K) | Pressure (bar) | Reference | Comment |
---|---|---|---|
455.2 | 0.004 | Weast and Grasselli, 1989 | BS |
Enthalpy of vaporization
ΔvapH (kJ/mol) | Temperature (K) | Method | Reference | Comment |
---|---|---|---|---|
87.7 | 409. | A,MG,OM | Stephenson and Malanowski, 1987 | Based on data from 394. to 459. K. See also Scott, Macmillan, et al., 1952.; AC |

Reaction thermochemistry data

Data compiled by: Hussein Y. Afeefy, Joel F. Liebman, and Stephen E. Stein
Individual Reactions
By formula: 3H2 + C19H32O2 = C19H38O2
Quantity | Value | Units | Method | Reference | Comment |
---|---|---|---|---|---|
ΔrH° | -357.3 ± 2.4 | kJ/mol | Chyd | Rogers and Siddiqui, 1975 | liquid phase; solvent: n-Hexane |

Kovats' RI, non-polar column, isothermal

Column type | Active phase | Temperature (C) | I | Reference | Comment |
---|---|---|---|---|---|
Capillary | OV-101 | 200. | 2071.8 | Kittiratanapiboon, Jeyashoke, et al., 1998 | 15. m/0.25 mm/0.2 μm, N2 |
Capillary | CP Sil 5 CB | 240. | 2078. | Hanai and Hong, 1989 | 30. m/0.25 mm/0.25 μm |
Capillary | DB-1 | 240. | 2092. | Hanai and Hong, 1989 | 30. m/0.25 mm/0.25 μm |
Packed | SE-30 | 200. | 2079. | Golovnya and Kuzmenko, 1977 | He, Chromosorb W (80-100 mesh); Column length: 1.5 m |

Kovats' RI, non-polar column, temperature ramp

Column type | Active phase | I | Reference | Comment |
---|---|---|---|---|
Capillary | BP-1 | 2058. | Raina, Verma, et al., 2006 | 25. m/0.32 mm/0.25 μm, N2, 5. K/min, 220. C @ 13. min; Tstart: 60. C |

Kovats' RI, polar column, isothermal

Column type | Active phase | Temperature (C) | I | Reference | Comment |
---|---|---|---|---|---|
Capillary | DB-Wax | 240. | 2590. | Hanai and Hong, 1989 | 25. m/0.25 mm/0.22 μm |

Van Den Dool and Kratz RI, non-polar column, temperature ramp

Column type | Active phase | I | Reference | Comment |
---|---|---|---|---|
Capillary | DB-5 | 2108. | Rout, Rao, et al., 2007 | 25. m/0.25 mm/0.25 μm, He, 2. K/min, 200. C @ 60. min; Tstart: 60. C |
Capillary | HP-5MS | 2105.4 | Zeng, Zhao, et al., 2007 | 30. m/0.25 mm/0.25 μm, He, 4. K/min; Tstart: 80. C; Tend: 300. C |
Capillary | SPB-1 | 2077. | Radulovic, Lazarevic, et al., 2006 | 30. m/0.25 mm/0.25 μm, He, 50. C @ 3. min, 5. K/min, 250. C @ 15. min |
Capillary | HP-5 | 2101. | Zhao, Wang X.Y., et al., 2006 | 30. m/0.25 mm/0.25 μm, He, 50. C @ 3. min, 10. K/min; Tend: 260. C |
Capillary | HP-1 | 2098. | Senatore, Rigano, et al., 2003 | 30. m/0.25 mm/0.33 μm, He, 40. C @ 5. min, 2. K/min, 260. C @ 20. min |
Capillary | BP-1 | 2073. | Tan, Wilkins, et al., 1989 | H2, 40. C @ 2. min, 4. K/min, 240. C @ 75. min; Column length: 12. m |
Capillary | OV-1 | 2069. | Tan, Holland, et al., 1988 | He, 8. K/min, 280. C @ 10. min; Column length: 25. m; Column diameter: 0.32 mm; Tstart: 40. C |

Van Den Dool and Kratz RI, non-polar column, custom temperature program

Column type | Active phase | I | Reference | Comment |
---|---|---|---|---|
Capillary | HP-1 | 2084. | Sing, Smadja, et al., 1992 | 50. m/0.32 mm/1.05 μm, He; Program: 20C(0.5min) => 60C => 4C/min => 250C |

Normal alkane RI, non-polar column, isothermal

Column type | Active phase | Temperature (C) | I | Reference | Comment |
---|---|---|---|---|---|
Capillary | LM-1 | 210. | 2078. | Filho and Lancas, 1995 | 30. m/0.25 mm/0.25 μm, Hydrogen |

Normal alkane RI, non-polar column, temperature ramp

Column type | Active phase | I | Reference | Comment |
---|---|---|---|---|
Capillary | RTx-1 | 2081. | Dib, Bendahou, et al., 2010 | 60. m/0.22 mm/0.25 μm, Helium, 2. K/min, 230. C @ 35. min; Tstart: 60. C |
Capillary | SPB-1 | 2089. | Escalona-Arranz, Perez-Roses, et al., 2010 | 30. m/0.32 mm/0.25 μm, Helium, 30. C @ 3. min, 4. K/min, 250. C @ 10. min |
Capillary | OV-1 | 2076. | Hu, Liang, et al., 2010 | 30. m/0.25 mm/0.25 μm, Helium, 50. C @ 3. min, 5. K/min, 250. C @ 2. min |
Capillary | SPB-1 | 2073. | Lazarevic, Palic, et al., 2010 | 30. m/0.25 mm/0.25 μm, Helium, 50. C @ 3. min, 5. K/min, 250. C @ 15. min |
Capillary | HP-5 MS | 2113. | Vedernikov and Roschin, 2010 | 30. m/0.25 mm/0.25 μm, Helium, 5. K/min, 280. C @ 10. min; Tstart: 150. C |
Capillary | HP-5 MS | 2100. | Zhao, Zeng, et al., 2009 | 30. m/0.25 mm/0.25 μm, Helium, 4. K/min; Tstart: 50. C; Tend: 280. C |
Capillary | HP-5MS | 2125. | Calyecac-cortero, Cibrian-Tovar, et al., 2007 | 30. m/0.32 mm/0.25 μm, N2, 50. C @ 1. min, 1. K/min; Tend: 200. C |
Capillary | RTX-5 MS | 2098. | Edris, Chizzola, et al., 2007 | 30. m/0.25 mm/0.25 μm, He, 60. C @ 2. min, 2. K/min, 200. C @ 10. min |
Capillary | Elite-5MS | 2096. | Tava, Pecetti, et al., 2007 | 30. m/0.32 mm/0.5 μm, He, 40. C @ 5. min, 4. K/min, 280. C @ 10. min |
Capillary | HP-101 | 2081. | Mastelic, Jerkovic, et al., 2006 | 25. m/0.2 mm/0.2 μm, He, 70. C @ 2. min, 3. K/min, 200. C @ 15. min |
Capillary | DB-5 | 2099. | Rout, Naik, et al., 2006 | 30. m/0.25 mm/0.25 μm, He, 2. K/min, 200. C @ 60. min; Tstart: 60. C |
Capillary | DB-5 | 2096. | Rout, Misra, et al., 2005 | 25. m/0.25 mm/0.25 μm, He, 2. K/min, 200. C @ 80. min; Tstart: 60. C |
Capillary | HP-5 | 2073. | N/A | 30. m/0.32 mm/0.25 μm, Helium, 40. C @ 2. min, 5. K/min, 250. C @ 5. min |
Capillary | DB-5 | 2098. | Senatore, Rigano, et al., 2004 | 30. m/0.25 mm/0.25 μm, He, 40. C @ 5. min, 2. K/min, 250. C @ 20. min |
Capillary | BP-5 | 2082. | Ardakani, Mosaddegh, et al., 2003 | He, 3. K/min; Column length: 25. m; Column diameter: 0.33 mm; Tstart: 50. C; Tend: 275. C |
Capillary | DB-5 | 2099. | Senatore and Bruno, 2003 | 30. m/0.25 mm/0.25 μm, 40. C @ 5. min, 2. K/min; Tend: 260. C |
Capillary | DB-5 | 2098. | Tellez, Khan, et al., 2002 | 30. m/0.25 mm/0.25 μm, He, 3. K/min; Tstart: 60. C; Tend: 240. C |
Capillary | OV-101 | 2078. | Ehrhardt, Osterroht, et al., 1980 | Hydrogen, 60. C @ 0.5 min, 4. K/min; Column length: 30. m; Column diameter: 0.35 mm; Tend: 270. C |
Capillary | OV-101 | 2078. | Ehrhardt, Osterroht, et al., 1980 | Hydrogen, 60. C @ 0.5 min, 4. K/min; Column length: 30. m; Column diameter: 0.35 mm; Tend: 270. C |

Normal alkane RI, non-polar column, custom temperature program

Column type | Active phase | I | Reference | Comment |
---|---|---|---|---|
Capillary | VF-5 | 2108. | Shivashankar, Roy, et al., 2012 | 30. m/0.25 mm/0.25 μm, Helium; Program: 50 0C (2 min) 3 0C/min -> 200 0C (3 min) 10 0C/min -> 220 0C (8 min) |
Capillary | VF-5 | 2098. | Shivashankar, Roy, et al., 2012 | 30. m/0.25 mm/0.25 μm, Helium; Program: not specified |
Capillary | HP-5 MS | 2047. | Grzeszczuk, Wesolowska, et al., 2011 | 30. m/0.25 mm/0.25 μm, Helium; Program: 40 0C (5 min) 30 0C/min -> 60 0C 6 0C/min -> 230 0C (10 min) |
Capillary | RTx-1 | 2081. | Dib, Bendahou, et al., 2010 | 60. m/0.22 mm/0.25 μm, Helium; Program: not specified |
Capillary | HP-5 MS | 2098. | Vedernikov and Roschin, 2010 | 30. m/0.25 mm/0.25 μm, Helium; Program: not specified |
Capillary | HP-5 | 2095. | Maggi, Bilek, et al., 2009 | 25. m/0.32 mm/0.17 μm, Helium; Program: 60 0C (5 min) 4 0C/min -> 220 0C 11 0C/min -> 280 0C |
Capillary | OV-1 | 2080. | El-Shazly and Hussein, 2004 | He; Column length: 15. m; Column diameter: 0.317 mm; Program: 50C(4min) => 4C/min => 90C => 10C/min => 300C(10min) |

Normal alkane RI, polar column, temperature ramp

Column type | Active phase | I | Reference | Comment |
---|---|---|---|---|
Capillary | Supelcowax-10 | 2508. | Calyecac-cortero, Cibrian-Tovar, et al., 2007 | 30. m/0.32 mm/0.25 μm, N2, 50. C @ 1. min, 1. K/min; Tend: 200. C |

Normal alkane RI, polar column, custom temperature program

Column type | Active phase | I | Reference | Comment |
---|---|---|---|---|
Capillary | Innowax FSC | 2583. | Baser, Özek, et al., 2004 | 60. m/0.25 mm/0.25 μm, He; Program: 60C(10min) => 4C/min => 220C(10min) => 1C/min => 240C |
Capillary | HP-Innowax FSC | 2583. | Erdemoglu, Sener, et al., 2003 | 60. m/0.25 mm/0.25 μm, He; Program: 60C(10min) => 4C/min => 220C(10min) => 1C/min => 240C |
Capillary | Supelcowax 10 | 2550. | Castioni and Kapetanidis, 1996 | 60. m/0.25 mm/0.25 μm, Helium; Program: 60 0C (10 min) 2 0C/min -> 80 0C 3 0C/min -> 100 0C 4 0C/min -> 220 0C (30 min) |
Capillary | Supelcowax 10 | 2558. | Castioni and Kapetanidis, 1996 | 60. m/0.25 mm/0.25 μm, Helium; Program: not specified |

References

Rogers and Siddiqui, 1975
Rogers, D.W.; Siddiqui, N.A.,
Heats of hydrogenation of large molecules. I. Esters of unsaturated fatty acids,
J. Phys. Chem., 1975, 79, 574-577. [all data]
Freedman, Bagby, et al., 1989
Freedman, B.; Bagby, M.O.; Khoury, H.,
Correlation of heats of combustion with empirical formulas for fatty alcohols,
J. Am. Oil Chem. Soc., 1989, 66, 595-596. [all data]
Lipkind, Kapustin, et al., 2007
Lipkind, Dmitry; Kapustin, Yaroslav; Umnahanant, Patamaporn; Chickos, James S.,
The vaporization enthalpies and vapor pressures of a series of unsaturated fatty acid methyl esters by correlation gas chromatography,
Thermochimica Acta, 2007, 456, 2, 94-101, https://doi.org/10.1016/j.tca.2007.02.008
. [all data]
Krop, Velzen, et al., 1997
Krop, Hildo B.; Velzen, Martin J.M.v.; Parsons, John R.; Govers, Harrie A.J.,
Determination of environmentally relevant physical-chemical properties of some fatty acid esters,
J Amer Oil Chem Soc, 1997, 74, 3, 309-315, https://doi.org/10.1007/s11746-997-0142-9
. [all data]
Weast and Grasselli, 1989
CRC Handbook of Data on Organic Compounds, 2nd Editon, Weast,R.C and Grasselli, J.G., ed(s)., CRC Press, Inc., Boca Raton, FL, 1989, 1. [all data]
Stephenson and Malanowski, 1987
Stephenson, Richard M.; Malanowski, Stanislaw,
Handbook of the Thermodynamics of Organic Compounds, 1987, https://doi.org/10.1007/978-94-009-3173-2
. [all data]
Scott, Macmillan, et al., 1952
Scott, T.A., Jr.; Macmillan, D.; Melvin, E.H.,
Vapor pressures and distillation of methyl esters of some fatty acids,
Ind. Eng. Chem., 1952, 44, 172-175. [all data]