2-(Diethylamino)acetonitrile
- Formula: C6H12N2
- Molecular weight: 112.1729
- IUPAC Standard InChIKey: LVPZSMIBSMMLPI-UHFFFAOYSA-N
- CAS Registry Number: 3010-02-4
- Chemical structure:
View 3d structure (requires JavaScript / HTML 5) - Other names: Diethylaminoacetonitrile; Acetonitrile, (diethylamino)-; Glycinonitrile, N,N-diethyl-; N,N-Diethylaminoacetonitrile; Nitril kiseliny diethylaminooctove

Gas phase thermochemistry data

Data compiled by: Hussein Y. Afeefy, Joel F. Liebman, and Stephen E. Stein
Quantity | Value | Units | Method | Reference | Comment |
---|---|---|---|---|---|
ΔfH°gas | 66.0 ± 1.0 | kJ/mol | Ccb | Welle, Verevkin, et al., 1997 |

Condensed phase thermochemistry data

Data compiled by: Hussein Y. Afeefy, Joel F. Liebman, and Stephen E. Stein
Quantity | Value | Units | Method | Reference | Comment |
---|---|---|---|---|---|
ΔfH°liquid | 16.1 ± 1.0 | kJ/mol | Ccb | Welle, Verevkin, et al., 1997 | |
Quantity | Value | Units | Method | Reference | Comment |
ΔcH°liquid | -4092.15 ± 0.85 | kJ/mol | Ccb | Welle, Verevkin, et al., 1997 |

Phase change data

Data compiled as indicated in comments:
BS - Robert L. Brown and Stephen E. Stein
ALS - Hussein Y. Afeefy, Joel F. Liebman, and Stephen E. Stein
DRB - Donald R. Burgess, Jr.
AC - William E. Acree, Jr., James S. Chickos
Quantity | Value | Units | Method | Reference | Comment |
---|---|---|---|---|---|
Tboil | 443.2 | K | N/A | Weast and Grasselli, 1989 | BS |
Quantity | Value | Units | Method | Reference | Comment |
ΔvapH° | 49.93 ± 0.27 | kJ/mol | V | Welle, Verevkin, et al., 1997 | ALS |
ΔvapH° | 49.9 | kJ/mol | N/A | Welle, Verevkin, et al., 1997 | DRB |
Reduced pressure boiling point
Tboil (K) | Pressure (bar) | Reference | Comment |
---|---|---|---|
343.2 | 0.032 | Weast and Grasselli, 1989 | BS |
Enthalpy of vaporization
ΔvapH (kJ/mol) | Temperature (K) | Method | Reference | Comment |
---|---|---|---|---|
49.9 ± 0.3 | 283. to 318. | GS | Welle, Verevkin, et al., 1997 | AC |

Normal alkane RI, non-polar column, temperature ramp

Column type | Active phase | I | Reference | Comment |
---|---|---|---|---|
Capillary | OV-101 | 912. | Zenkevich, 2005 | 25. m/0.20 mm/0.10 μm, N2/He, 6. K/min; Tstart: 50. C; Tend: 250. C |

References

Welle, Verevkin, et al., 1997
Welle, F.M.; Verevkin, S.P.; Beckhaus, H.-D.; Ruchardt, C.,
Stabilization of the cyano(dimethylamino)methyl radical - synergistic effect due to interaction between α-cyano groups on the radical stabilization energy,
Liebigs Ann., 1997, 155-163. [all data]
Weast and Grasselli, 1989
CRC Handbook of Data on Organic Compounds, 2nd Editon, Weast,R.C and Grasselli, J.G., ed(s)., CRC Press, Inc., Boca Raton, FL, 1989, 1. [all data]
Zenkevich, 2005
Zenkevich, I.G.,
Experimentally measured retention indices., 2005. [all data]