Benzoic acid, 2-amino-, pentyl ester
- Formula: C12H17NO2
- Molecular weight: 207.2689
- IUPAC Standard InChIKey: JCKCYPSMCQDSHT-UHFFFAOYSA-N
- CAS Registry Number: 30100-15-3
- Chemical structure:
View 3d structure (requires JavaScript / HTML 5) - Other names: Anthranilic acid, pentyl ester; Pentyl 2-aminobenzoate; pentyl anthranilate

Van Den Dool and Kratz RI, non-polar column, temperature ramp

Column type | Active phase | I | Reference | Comment |
---|---|---|---|---|
Capillary | VF-5MS | 1753. | Todua, 2011 | 30. m/0.25 mm/0.25 μm, He; Tstart: 60. C; Tend: 270. C |

Normal alkane RI, non-polar column, custom temperature program

Column type | Active phase | I | Reference | Comment |
---|---|---|---|---|
Capillary | SE-30 | 1700. | Vinogradov, 2004 | Program: not specified |

Normal alkane RI, polar column, custom temperature program

Column type | Active phase | I | Reference | Comment |
---|---|---|---|---|
Capillary | Carbowax 20M | 2510. | Vinogradov, 2004 | Program: not specified |

References

Todua, 2011
Todua, N.G.,
Retention Data. NIST Mass Spectrometry Data Center., NIST Mass Spectrometry Data Center, 2011. [all data]
Vinogradov, 2004
Vinogradov, B.A.,
Production, composition, properties and application of essential oils, 2004, retrieved from http://viness.narod.ru. [all data]