3,5-Octadien-2-one, (E,E)-
- Formula: C8H12O
- Molecular weight: 124.1803
- IUPAC Standard InChIKey: LWRKMRFJEUFXIB-YTXTXJHMSA-N
- CAS Registry Number: 30086-02-3
- Chemical structure:
View 3d structure (requires JavaScript / HTML 5) - Species with the same structure:
- Stereoisomers:
- Other names: (3E,5E)-3,5-Octadien-2-one; 3,5-(E,E)-Octadien-2-one; (E)-3,(E)-5-Octadien-2-one; (E,E)-3,5-Octadien-2-one; (E,E)-Octa-3,5-dien-2-one; Octa-3(E),5(E)-dien-2-one; trans-3,trans-5-Octadien-2-one; trans,trans-3,5-Octadien-2-one; 3,5-Octadien-2-one #1; (E,E) 3,5-Octadiene-2-one

Kovats' RI, non-polar column, temperature ramp

Column type | Active phase | I | Reference | Comment |
---|---|---|---|---|
Capillary | OV-101 | 1072. | Yamaguchi and Shibamoto, 1981 | N2, 2. K/min; Column length: 70. m; Column diameter: 0.28 mm; Tstart: 80. C; Tend: 200. C |

Kovats' RI, polar column, temperature ramp

Column type | Active phase | I | Reference | Comment |
---|---|---|---|---|
Capillary | Carbowax 20M | 1524. | Yamaguchi and Shibamoto, 1981 | N2, 2. K/min; Column length: 70. m; Column diameter: 0.28 mm; Tstart: 80. C; Tend: 200. C |

Van Den Dool and Kratz RI, non-polar column, temperature ramp

Column type | Active phase | I | Reference | Comment |
---|---|---|---|---|
Capillary | SPB-5 | 1072. | Engel and Ratel, 2007 | 60. m/0.32 mm/1. μm, 40. C @ 2. min, 3. K/min, 230. C @ 10. min |
Capillary | DB-5MS | 1098. | Lozano P.R., Drake M., et al., 2007 | 30. m/0.25 mm/0.25 μm, He, 35. C @ 5. min, 10. K/min, 225. C @ 25. min |
Capillary | HP-5 | 1100. | Solina, Baumgartner, et al., 2005 | 25. m/0.2 mm/1. μm, He, 5. K/min, 280. C @ 5. min; Tstart: 40. C |

Van Den Dool and Kratz RI, non-polar column, custom temperature program

Column type | Active phase | I | Reference | Comment |
---|---|---|---|---|
Capillary | HP-5 | 1083. | Boué, Shih, et al., 2003 | 50. m/0.2 mm/0.5 μm, He; Program: 40C(3min) => 10C/min => 60C =3C/min => 150C => 20C/min => 250C (5min) |
Capillary | DB-5 | 1068. | Beaulieu and Grimm, 2001 | 30. m/0.25 mm/0.25 μm, He; Program: 50C (1min) => 5C/min => 100C => 10C/min => 250C (9min) |
Capillary | DB-5 | 1107. | Parker, Hassell, et al., 2000 | 50. m/0.32 mm/0.5 μm, He; Program: oC(5min) => 60C/min => 60C (5min) => 4C/min => 250C |

Van Den Dool and Kratz RI, polar column, temperature ramp

Column type | Active phase | I | Reference | Comment |
---|---|---|---|---|
Capillary | FFAP | 1569. | Lozano P.R., Drake M., et al., 2007 | 30. m/0.25 mm/0.25 μm, He, 35. C @ 5. min, 10. K/min, 225. C @ 25. min |
Capillary | DB-Wax | 1570. | Fernandez-Segovia, Escriche, et al., 2006 | 30. m/0.25 mm/0.25 μm, He, 50. C @ 5. min, 10. K/min, 230. C @ 25. min |
Capillary | CP-Wax 52CB | 1565. | Alasalvar, Taylor, et al., 2005 | 60. m/0.25 mm/0.25 μm, 35. C @ 4. min, 3. K/min; Tend: 203. C |
Capillary | Supelcowax-10 | 1527. | Elmore, Nisyrios, et al., 2005 | 60. m/0.25 mm/0.25 μm, He, 40. C @ 2. min, 4. K/min; Tend: 280. C |
Capillary | Supelcowax-10 | 1576. | Chung, 1999 | 60. m/0.25 mm/0.25 μm, He, 35. C @ 5. min, 2. K/min, 195. C @ 90. min |
Capillary | DB-Wax | 1562. | Shimoda, Shigematsu, et al., 1995 | 60. m/0.25 mm/0.25 μm, He, 2. K/min; Tstart: 50. C; Tend: 230. C |

Van Den Dool and Kratz RI, polar column, custom temperature program

Column type | Active phase | I | Reference | Comment |
---|---|---|---|---|
Capillary | CP-Wax 52CB | 1521. | Romeo, Ziino, et al., 2007 | 60. m/0.25 mm/0.25 μm, He; Program: 45C(5min) => 10C/min => 80C => 2C/min => 240C |
Capillary | DB-Wax | 1570. | Pennarun, Prost, et al., 2003 | 30. m/0.32 mm/0.5 μm, He; Program: 50C => 6C/min => 70C => 4C/min => 150C => 10C/min => 250C |
Capillary | DB-Wax | 1570. | Pennarun, Prost, et al., 2002 | 30. m/0.32 mm/0.5 μm, He; Program: 50C => 6C/min => 70C => 4C/min => 150C => 10C/min => 250C |
Capillary | Supelcowax-10 | 1575. | Baek and Cadwallader, 1996 | 60. m/0.25 mm/0.25 μm; Program: 40C => (6C/min) => 80C(6min) => (15C/min) => 200C(10min) |

Normal alkane RI, non-polar column, temperature ramp

Column type | Active phase | I | Reference | Comment |
---|---|---|---|---|
Capillary | HP-1 | 1068. | Valette, Fernandez, et al., 2006 | 50. m/0.2 mm/0.5 μm, He, 2. K/min, 250. C @ 40. min; Tstart: 60. C |
Capillary | HP-5 | 1093.6 | Leffingwell and Alford, 2005 | 60. m/0.32 mm/0.25 μm, He, 30. C @ 2. min, 2. K/min, 260. C @ 28. min |
Capillary | HP-1 | 1057. | Valette, Fernandez, et al., 2003 | 50. m/0.2 mm/0.5 μm, He, 2. K/min, 220. C @ 40. min; Tstart: 60. C |
Capillary | Optima-1 | 1074. | Brun, Bessière, et al., 2001 | 25. m/0.20 mm/0.25 μm, He, 50. C @ 3. min, 3. K/min; Tend: 250. C |
Capillary | DB-1 | 1063. | Buttery and Ling, 1995 | He, 30. C @ 25. min, 4. K/min, 200. C @ 20. min; Column length: 60. m; Column diameter: 0.25 mm |
Capillary | DB-1 | 1063. | Hansen, Buttery, et al., 1992 | 30. C @ 25. min, 4. K/min, 200. C @ 20. min; Column length: 60. m; Column diameter: 0.32 mm |
Capillary | SE-30 | 1068. | Heydanek and McGorrin, 1981 | 40. C @ 3. min, 3. K/min; Column length: 50. m; Column diameter: 0.5 mm; Tend: 170. C |
Capillary | SE-30 | 1069. | Heydanek and McGorrin, 1981, 2 | He, 40. C @ 3. min, 3. K/min; Column length: 50. m; Column diameter: 0.5 mm; Tend: 170. C |

Normal alkane RI, non-polar column, custom temperature program

Column type | Active phase | I | Reference | Comment |
---|---|---|---|---|
Capillary | SLB-5 MS | 1072. | Mondello, 2012 | 30. m/0.25 mm/0.25 μm, Helium; Program: not specified |
Capillary | SLB-5 MS | 1072. | Mondello, 2012 | 30. m/0.25 mm/0.25 μm, Helium; Program: not specified |
Capillary | RTX-5 MS | 1073. | Mebazaa, Mahmoudi, et al., 2009 | 30. m/0.25 mm/0.25 μm, Helium; Program: 50 0C (5 min) 2 0C/min -> 100 0C (5 min) 5 0C/min -> 300 0C |
Capillary | RTX-5 MS | 1068. | Mebazaa, Mahmoudi, et al., 2009 | 30. m/0.25 mm/0.25 μm, Helium; Program: not specified |
Capillary | DB-5 MS | 1066. | Zhu, Li, et al., 2008 | 30. m/0.25 mm/0.25 μm, Helium; Program: 50 0C (2.8 min) 5.5 0C/min -> 140 0C (1 min) 4.5 oC/min -> 220 0C -> 225 0C (2 min) 3.4 0C/min -> 265 0C (5 min) |
Capillary | DB-5 MS | 1091. | Zhu, Li, et al., 2008 | 30. m/0.25 mm/0.25 μm, Helium; Program: 50 0C (2.8 min) 5.5 0C/min -> 140 0C (1 min) 4.5 oC/min -> 220 0C -> 225 0C (2 min) 3.4 0C/min -> 265 0C (5 min) |

Normal alkane RI, polar column, temperature ramp

Column type | Active phase | I | Reference | Comment |
---|---|---|---|---|
Capillary | DB-Wax | 1585. | Rochat, Egger, et al., 2009 | 30. m/0.25 mm/0.25 μm, Helium, 60. C @ 3. min, 8. K/min, 200. C @ 9.5 min |
Capillary | DB-Wax | 1590. | Rochat, Egger, et al., 2009 | 30. m/0.25 mm/0.25 μm, Helium, 60. C @ 3. min, 8. K/min, 200. C @ 9.5 min |
Capillary | DB-Wax | 1608. | Rochat, Egger, et al., 2009 | 30. m/0.25 mm/0.25 μm, Helium, 60. C @ 3. min, 8. K/min, 200. C @ 9.5 min |
Capillary | DB-Wax | 1609. | Rochat, Egger, et al., 2009 | 30. m/0.25 mm/0.25 μm, Helium, 60. C @ 3. min, 8. K/min, 200. C @ 9.5 min |
Capillary | DB-Wax | 1610. | Rochat, Egger, et al., 2009 | 30. m/0.25 mm/0.25 μm, Helium, 60. C @ 3. min, 8. K/min, 200. C @ 9.5 min |
Capillary | ZB-Wax | 1595. | Wierda R.L., Fletcher G., et al., 2006 | 60. m/0.32 mm/0.5 μm, He, 40. C @ 2. min, 3. K/min, 250. C @ 10. min |
Capillary | DB-Wax | 1566. | Buttery and Ling, 1998 | 30. C @ 4. min, 2. K/min, 170. C @ 30. min; Column length: 60. m; Column diameter: 0.25 mm |
Capillary | TC-Wax | 1575. | Shuichi, Masazumi, et al., 1996 | 80. C @ 5. min, 3. K/min; Column length: 60. m; Column diameter: 0.25 mm; Tend: 240. C |
Capillary | Carbowax 20M | 1539. | Kawakami, Ganguly, et al., 1995 | 60. C @ 4. min, 2. K/min; Column length: 60. m; Column diameter: 0.25 mm; Tend: 180. C |
Capillary | Carbowax 20M | 1539. | Kawakami, Kobayashi, et al., 1993 | He, 60. C @ 4. min, 2. K/min; Column length: 50. m; Column diameter: 0.25 mm; Tend: 180. C |
Capillary | Carbowax 20M | 1539. | Kawakami and Kobayashi, 1991 | He, 60. C @ 4. min, 2. K/min; Column length: 50. m; Column diameter: 0.25 mm; Tend: 180. C |
Capillary | Supelcowax-10 | 1570. | Hsieh, Williams, et al., 1989 | 60. m/0.25 mm/0.25 μm, He, 40. C @ 5. min, 1. K/min; Tend: 175. C |
Capillary | Carbowax 20M | 1550. | Buttery, Parker, et al., 1981 | 50. C @ 30. min, 1. K/min; Column length: 150. m; Column diameter: 0.64 mm; Tend: 170. C |
Capillary | Carbowax 20M | 1550. | Buttery and Kamm, 1980 | 50. C @ 30. min, 1. K/min; Column length: 150. m; Column diameter: 0.64 mm; Tend: 170. C |
Capillary | Carbowax 20M | 1550. | Buttery, Ling, et al., 1980 | 50. C @ 30. min, 1. K/min; Column length: 150. m; Column diameter: 0.64 mm; Tend: 170. C |

Normal alkane RI, polar column, custom temperature program

Column type | Active phase | I | Reference | Comment |
---|---|---|---|---|
Capillary | DB-FFAP | 1549. | Mebazaa, Mahmoudi, et al., 2009 | 30. m/0.25 mm/0.25 μm, Helium; Program: 50 0C 2 0C/min -> 100 0C (5 min) 5 0C/min -> 250 0C |
Capillary | DB-FFAP | 1563. | Mebazaa, Mahmoudi, et al., 2009 | 30. m/0.25 mm/0.25 μm, Helium; Program: not specified |
Capillary | DB-Wax | 1570. | Rochat, Egger, et al., 2009 | 30. m/0.25 mm/0.25 μm, Helium; Program: not specified |
Capillary | HP Innowax FSP | 1573. | Altintas, Kose, et al., 2004 | 60. m/0.25 mm/0.25 μm, N2; Program: 60C(10min) => 4C/min => 220C(10min) => 1C/min => 240C |
Capillary | Innowax FSC | 1573. | Baser, Özek, et al., 2004 | 60. m/0.25 mm/0.25 μm, He; Program: 60C(10min) => 4C/min => 220C(10min) => 1C/min => 240C |
Capillary | Innowax FSC | 1573. | Baser, Özek, et al., 2004 | 60. m/0.25 mm/0.25 μm, He; Program: 60C(10min) => 4C/min => 220C(10min) => 1C/min => 240C |
Capillary | DB-Wax | 1569. | Kim. J.H., Ahn, et al., 2004 | 60. m/0.25 mm/0.25 μm, Helium; Program: 60 0C (3 min) 2 0C/min -> 150 0C 4 0C/min -> 200 0C |
Capillary | Innowax FSC | 1573. | Saglam, Gozler, et al., 2001 | 60. m/0.25 mm/0.25 μm, He; Program: 60C(10min) => 4C/min => 220C(10min) => 1C/min => 240C |
Capillary | Supelcowax 10 | 1565. | Castioni and Kapetanidis, 1996 | 60. m/0.25 mm/0.25 μm, Helium; Program: 60 0C (10 min) 2 0C/min -> 80 0C 3 0C/min -> 100 0C 4 0C/min -> 220 0C (30 min) |
Capillary | Supelcowax 10 | 1563. | Castioni and Kapetanidis, 1996 | 60. m/0.25 mm/0.25 μm, Helium; Program: not specified |
Capillary | Supelcowax 10 | 1578. | Castioni and Kapetanidis, 1996 | 60. m/0.25 mm/0.25 μm, Helium; Program: not specified |

References

Yamaguchi and Shibamoto, 1981
Yamaguchi, K.; Shibamoto, T.,
Volatile constituents of green tea, Gyokuro (Camellia sinensis L. var Yabukita),
J. Agric. Food Chem., 1981, 29, 2, 366-370, https://doi.org/10.1021/jf00104a035
. [all data]
Engel and Ratel, 2007
Engel, E.; Ratel, J.,
Correction of the data generated by mass spectrometry analyses of biological tissues: Application to food authentication,
J. Chromatogr. A, 2007, 1154, 1-2, 331-341, https://doi.org/10.1016/j.chroma.2007.02.012
. [all data]
Lozano P.R., Drake M., et al., 2007
Lozano P.R.; Drake M.; Benitez D.; Cadwallader K.R.,
Instrumental and sensory characterization of heat-induced odorants in aseptically packaged soy milk,
J. Agric. Food Chem., 2007, 55, 8, 3018-3026, https://doi.org/10.1021/jf0631225
. [all data]
Solina, Baumgartner, et al., 2005
Solina, M.; Baumgartner, P.; Johnson, R.L.; Whitfield, F.B.,
Volatile aroma components of soy protein isolate and acid-hydrolysed vegetable protein,
Food Chem., 2005, 90, 4, 861-873, https://doi.org/10.1016/j.foodchem.2004.06.005
. [all data]
Boué, Shih, et al., 2003
Boué, S.M.; Shih, B.Y.; Carter-Wientjes, C.H.; Cleveland, T.E.,
Identification of volatile compounds in soybean at various developmental stages using solid phase microextraction,
J. Agric. Food Chem., 2003, 51, 17, 4873-4876, https://doi.org/10.1021/jf030051q
. [all data]
Beaulieu and Grimm, 2001
Beaulieu, J.C.; Grimm, C.C.,
Identification of volatile compounds in cantaloupe at various developmental stages using solid phase microextraction,
J. Agric. Food Chem., 2001, 49, 3, 1345-1352, https://doi.org/10.1021/jf0005768
. [all data]
Parker, Hassell, et al., 2000
Parker, J.K.; Hassell, G.M.E.; Mottram, D.S.; Guy, R.C.E.,
Sensory and instrumental analyses of volatiles generated during the extrusion cooking of oat flours,
J. Agric. Food Chem., 2000, 48, 8, 3497-3506, https://doi.org/10.1021/jf991302r
. [all data]
Fernandez-Segovia, Escriche, et al., 2006
Fernandez-Segovia, I.; Escriche, I.; Gomez-Sintes, M.; Fuentes, A.; Serra, J.A.,
In?uence of di?erent preservation treatments on the volatile fraction of desalted cod,
Food Chem., 2006, 98, 3, 473-482, https://doi.org/10.1016/j.foodchem.2005.06.021
. [all data]
Alasalvar, Taylor, et al., 2005
Alasalvar, C.; Taylor, K.D.A.; Shahidi, F.,
Comparison of volatiles of cultured and wild sea bream (Sparus aurata) during storage in ice by dynamic headspace analysis/gas chromatography-mass spectrometry,
J. Agric. Food Chem., 2005, 53, 7, 2616-2622, https://doi.org/10.1021/jf0483826
. [all data]
Elmore, Nisyrios, et al., 2005
Elmore, J.S.; Nisyrios, I.; Mottram, D.S.,
Analysis of the headspace aroma compounds of walnuts (Juglans regia L.),
Flavour Fragr. J., 2005, 20, 5, 501-506, https://doi.org/10.1002/ffj.1477
. [all data]
Chung, 1999
Chung, H.Y.,
Volatile components in crabmeats of Charybdis feriatus,
J. Agric. Food Chem., 1999, 47, 6, 2280-2287, https://doi.org/10.1021/jf981027t
. [all data]
Shimoda, Shigematsu, et al., 1995
Shimoda, M.; Shigematsu, H.; Shiratsuchi, H.; Osajima, Y.,
Comparison of volatile compounds among different grades of green tea and their relations to odor attributes,
J. Agric. Food Chem., 1995, 43, 6, 1621-1625, https://doi.org/10.1021/jf00054a038
. [all data]
Romeo, Ziino, et al., 2007
Romeo, V.; Ziino, M.; Giuffrrida, D.; Condurso, C.; Verzera, A.,
Flavour profile of capers (Capparis spinosa L.) from the Eolian Archipelago by HS-SPME/GC?MS,
Food Chem., 2007, 101, 3, 1272-1278, https://doi.org/10.1016/j.foodchem.2005.12.029
. [all data]
Pennarun, Prost, et al., 2003
Pennarun, A.-L.; Prost, C.; Haure, J.; Demaimay, M.,
Comparison of two microalgal diets. 2. Influence on odorant composition and organoleptic qualities of raw oysters (Crassostrea gigas),
J. Agric. Food Chem., 2003, 51, 7, 2011-2018, https://doi.org/10.1021/jf020549c
. [all data]
Pennarun, Prost, et al., 2002
Pennarun, A.L.; Prost, C.; Demaimay, M.,
Identification and origin of the character-impact compounds of raw oyster Crassostrea gigas,
J. Sci. Food Agric., 2002, 82, 14, 1652-1660, https://doi.org/10.1002/jsfa.1236
. [all data]
Baek and Cadwallader, 1996
Baek, H.H.; Cadwallader, K.R.,
Volatile compounds in flavor concentrates produced from crayfish-processing byproducts with and without protease treatment,
J. Agric. Food Chem., 1996, 44, 10, 3262-3267, https://doi.org/10.1021/jf960023q
. [all data]
Valette, Fernandez, et al., 2006
Valette, L.; Fernandez, X.; Poulain, S.; Lizzani-Cuvelier, L.; Loiseau, A.-M.,
Chemical composition of the volatile extracts from Brassica oleracea L. var. botrytis 'Romanesco' cauliflower seeds,
Flavour Fragr. J., 2006, 21, 1, 107-110, https://doi.org/10.1002/ffj.1530
. [all data]
Leffingwell and Alford, 2005
Leffingwell, J.C.; Alford, E.D.,
Volatile constituents of Perique tobacco,
Electron. J. Environ. Agric. Food Chem., 2005, 4, 2, 899-915. [all data]
Valette, Fernandez, et al., 2003
Valette, L.; Fernandez, X.; Poulain, S.; Loiseau, A.-M.; Lizzani-Cuvelier, L.; Levieil, R.; Restier, L.,
Volatile constituents from Romanesco cauliflower,
Food Chem., 2003, 80, 3, 353-358, https://doi.org/10.1016/S0308-8146(02)00272-8
. [all data]
Brun, Bessière, et al., 2001
Brun, G.; Bessière, J.-M.; Dijoux-Franca, M.-G.; David, B.; Mariotte, A.-M.,
Volatile components of Catharanthus roseus (L.) G. Don (Apocynaceae),
Flavour Fragr. J., 2001, 16, 2, 116-119, https://doi.org/10.1002/ffj.958
. [all data]
Buttery and Ling, 1995
Buttery, R.G.; Ling, L.C.,
Volatile flavor components of corn tortillas and related products,
J. Agric. Food Chem., 1995, 43, 7, 1878-1882, https://doi.org/10.1021/jf00055a023
. [all data]
Hansen, Buttery, et al., 1992
Hansen, M.; Buttery, R.G.; Stern, D.J.; Cantwell, M.I.; Ling, L.C.,
Broccoli storage under low-oxygen atmosphere: Identification of higher boiling volatiles,
J. Agric. Food Chem., 1992, 40, 5, 850-852, https://doi.org/10.1021/jf00017a029
. [all data]
Heydanek and McGorrin, 1981
Heydanek, M.G.; McGorrin, R.J.,
Gas chromatography-mass spectroscopy identification of volatiles from rancid oat groats,
J. Agric. Food Chem., 1981, 29, 5, 1093-1095, https://doi.org/10.1021/jf00107a051
. [all data]
Heydanek and McGorrin, 1981, 2
Heydanek, M.G.; McGorrin, R.J.,
Gas chromatography-mass spectroscopy investigations on the flavor chemistry of oat groats,
J. Agric. Food Chem., 1981, 29, 5, 950-954, https://doi.org/10.1021/jf00107a016
. [all data]
Mondello, 2012
Mondello, L.,
HS-SPME-GCxGC-MS analysis of Yerba Mate (Ilex paraguariensis)
in Shimadzu GC-GC application compendium of comprehensive 2D GC, Vol. 1-5, Shimadzu Corp., 2012, 1-29. [all data]
Mebazaa, Mahmoudi, et al., 2009
Mebazaa, R.; Mahmoudi, A.; Fouchet, M.; Dos Santos, M.; Kamissoko, F.; Nafti, A.; Ben Cheikh, R.; Rega, B.; Camel, V.,
Characterization of volatile compounds in Tunisian fenugreek seeds,
Food Chem., 2009, 115, 4, 1326-1336, https://doi.org/10.1016/j.foodchem.2009.01.066
. [all data]
Zhu, Li, et al., 2008
Zhu, M.; Li, E.; He, H.,
Determination of volatile chemical constitutes in tea by simultaneous distillation extraction, vacuum hydrodistillation and thermal desrption,
Chromatographia, 2008, 68, 7/8, 603-610, https://doi.org/10.1365/s10337-008-0732-1
. [all data]
Rochat, Egger, et al., 2009
Rochat, S.; Egger, J.; Chaintreau, A.,
Strategy for the identification of key odorants: application to shrimp aroma,
J. Chromatogr. A, 2009, 1216, 36, 6424-6432, https://doi.org/10.1016/j.chroma.2009.07.014
. [all data]
Wierda R.L., Fletcher G., et al., 2006
Wierda R.L.; Fletcher G.; Xu L.; Dufour J.P.,
Analysis of volatile compounds as spoilage indicators in fresh king salmon (Oncorhynchus tshawytscha) during storage using SPME-GC-MS,
J. Agric. Food Chem., 2006, 54, 22, 8480-8490, https://doi.org/10.1021/jf061377c
. [all data]
Buttery and Ling, 1998
Buttery, R.G.; Ling, L.C.,
Additional studies on flavor components of corn tortilla chips,
J. Agric. Food Chem., 1998, 46, 7, 2764-2769, https://doi.org/10.1021/jf980125b
. [all data]
Shuichi, Masazumi, et al., 1996
Shuichi, H.; Masazumi, N.; Hiromu, K.; Kiyoshi, F.,
Comparison of volatile compounds berween the crude drugs, Onji-tsutsu and Onji-niki,
Nippon nogei kagaku kaishi, 1996, 70, 2, 151-160. [all data]
Kawakami, Ganguly, et al., 1995
Kawakami, M.; Ganguly, S.N.; Banerjee, J.; Kobayashi, A.,
Aroma composition of oolong tea and black tea by brewed extraction method and characterizing compounds of Darjeeling tea aroma,
J. Agric. Food Chem., 1995, 43, 1, 200-207, https://doi.org/10.1021/jf00049a037
. [all data]
Kawakami, Kobayashi, et al., 1993
Kawakami, M.; Kobayashi, A.; Kator, K.,
Volatile constituents of Rooibos tea (Aspalathus linearis) as affected by extraction process,
J. Agric. Food Chem., 1993, 41, 4, 633-636, https://doi.org/10.1021/jf00028a023
. [all data]
Kawakami and Kobayashi, 1991
Kawakami, M.; Kobayashi, A.,
Volatitle constituents of greem mate and roasted mate,
J. Agric. Food Chem., 1991, 39, 7, 1275-1279, https://doi.org/10.1021/jf00007a016
. [all data]
Hsieh, Williams, et al., 1989
Hsieh, T.C.Y.; Williams, S.S.; Vejaphan, W.; Meyers, S.P.,
Characterization of Volatile Components of Menhaden Fish (Brevoortia tyrannus) Oil,
J. Amer. Oil Chem. Soc., 1989, 66, 1, 114-117, https://doi.org/10.1007/BF02661797
. [all data]
Buttery, Parker, et al., 1981
Buttery, R.G.; Parker, F.D.; Teranishi, R.; Mon, T.R.; Ling, L.C.,
Volatile components of alfalfa leaf-cutter bee cells,
J. Agric. Food Chem., 1981, 29, 5, 955-958, https://doi.org/10.1021/jf00107a017
. [all data]
Buttery and Kamm, 1980
Buttery, R.G.; Kamm, J.A.,
Volatile components of alfalfa: possible insect host plant attractants,
J. Agric. Food Chem., 1980, 28, 5, 978-981, https://doi.org/10.1021/jf60231a014
. [all data]
Buttery, Ling, et al., 1980
Buttery, R.G.; Ling, L.C.; Teranishi, R.,
Volatile of corn tassels: possible corn ear worm attractants,
J. Agric. Food Chem., 1980, 28, 4, 771-774, https://doi.org/10.1021/jf60230a020
. [all data]
Altintas, Kose, et al., 2004
Altintas, A.; Kose, Y.B.; Yucel, E.; Demirci, B.; Baser, K.H.C.,
Composition of the essential oil of Centaurea dichroa,
Chem. Nat. Compd. (Engl. Transl.), 2004, 40, 6, 604-605, https://doi.org/10.1007/s10600-005-0051-9
. [all data]
Baser, Özek, et al., 2004
Baser, K.H.C.; Özek, T.; Kirimer, N.; Deliorman, D.; Ergun, F.,
Composition of the essential oils of Galium aparine L. and Galium odoratum (L.) Scop. from Turkey,
J. Essent. Oil Res., 2004, 16, 4, 305-307, https://doi.org/10.1080/10412905.2004.9698728
. [all data]
Kim. J.H., Ahn, et al., 2004
Kim. J.H.; Ahn, H.J.; Yook, H.S.; Kim, K.S.; Rhee, M.S.; Ryu, G.H.; Byun, M.W.,
Color, flavor, and sensory characteristics of gamma-irradiated salted and fermented anchovy sauce,
Radiation Phys. Chem., 2004, 69, 2, 179-187, https://doi.org/10.1016/S0969-806X(03)00400-6
. [all data]
Saglam, Gozler, et al., 2001
Saglam, H.; Gozler, T.; Kivcak, B.; Demirci, B.; Baser, K.H.C.,
Volatile compounds from Haplophyllum myrtifolium,
Chem. Nat. Compd. (Engl. Transl.), 2001, 37, 5, 442-444, https://doi.org/10.1023/A:1014467225815
. [all data]
Castioni and Kapetanidis, 1996
Castioni, P.; Kapetanidis, I.,
Volatile constituents from Brunfelsia grandiflora ssp. grandiflora: qualitative analysis by GC-MS,
Scientia Pharmaceutica, 1996, 64, 83-91. [all data]