2-Fluorenecarboxaldehyde
- Formula: C14H10O
- Molecular weight: 194.2286
- IUPAC Standard InChIKey: MNQGEQSXFDKAPY-UHFFFAOYSA-N
- CAS Registry Number: 30084-90-3
- Chemical structure:
View 3d structure (requires JavaScript / HTML 5) - Other names: Fluorene-2-carboxaldehyde; 9H-Fluorene-2-carboxaldehyde; fluorene-2-carbaldehyde

Phase change data

Data compiled by: William E. Acree, Jr., James S. Chickos
Enthalpy of sublimation
ΔsubH (kJ/mol) | Temperature (K) | Method | Reference |
---|---|---|---|
100.0 ± 3.4 | 338. to 356. | ME | Goldfarb and Suuberg, 2008 |

Normal alkane RI, non-polar column, custom temperature program

Data compiled by: NIST Mass Spectrometry Data Center, William E. Wallace, director

Column type Capillary
Active phase Methyl Silicone
Column length (m) 25.
Carrier gas He
Substrate
Column diameter (mm) 0.25
Phase thickness (μm) 0.25
Program 50 0C (2 min) 20 0C/min -> 160 0C 5 0C/min -> 210 0C 10 0C/min -> 300 0C
I 1902.
ReferenceOda, Yasuhara, et al., 1998
Comment MSDC-RI

References

Goldfarb and Suuberg, 2008
Goldfarb, Jillian L.; Suuberg, Eric M.,
VAPOR PRESSURES AND THERMODYNAMICS OF OXYGEN-CONTAINING POLYCYCLIC AROMATIC HYDROCARBONS MEASURED USING KNUDSEN EFFUSION,
Environ Toxicol Chem, 2008, 27, 6, 1244, https://doi.org/10.1897/07-486.1
. [all data]