N,N-Dimethyldodecanamide
- Formula: C14H29NO
- Molecular weight: 227.3862
- IUPAC Standard InChIKey: BDYUSDIJIDGWCY-UHFFFAOYSA-N
- CAS Registry Number: 3007-53-2
- Chemical structure:
View 3d structure (requires JavaScript / HTML 5) - Other names: Dodecanamide, N,N-dimethyl-; Hallcomid M 12; Lauryl N,N-dimethylamide; N,N-Dimethyldodecamide; N,N-Dimethyllauramide; 1-Dodecanamide, N,N-dimethyl-; Lauramide, N,N-dimethyl-

Phase change data

Data compiled by: Robert L. Brown and Stephen E. Stein
Reduced pressure boiling point
Tboil (K) | Pressure (bar) | Reference |
---|---|---|
453. to 454. | 0.020 | Frinton Laboratories Inc., 1986 |

Van Den Dool and Kratz RI, non-polar column, temperature ramp

Column type | Active phase | I | Reference | Comment |
---|---|---|---|---|
Capillary | DB-5 | 1504. | Adams, Habte, et al., 2004 | 30. m/0.26 mm/0.25 μm, He, 3. K/min; Tstart: 60. C; Tend: 246. C |

References

Frinton Laboratories Inc., 1986
Frinton Laboratories Inc.,
Catalog Number 11, Frinton Laboratories Inc., Vineland, NJ, 1986, 99. [all data]
Adams, Habte, et al., 2004
Adams, R.P.; Habte, M.; Park, S.; Dafforn, M.R.,
Preliminary comparison of vetiver root essential oils from cleansed (bacteria- and fungus-free) versus non-cleansed (normal) vetiver plants,
Biochem. Syst. Ecol., 2004, 32, 12, 1137-1144, https://doi.org/10.1016/j.bse.2004.03.013
. [all data]