3',5'-Bis(trifluoromethyl)acetophenone
- Formula: C10H6F6O
- Molecular weight: 256.1445
- IUPAC Standard InChIKey: MCYCSIKSZLARBD-UHFFFAOYSA-N
- CAS Registry Number: 30071-93-3
- Chemical structure:
View 3d structure (requires JavaScript / HTML 5) - Other names: 3,5-Bis(trifluoromethyl)acetophenone; 3,5-di(Trifluoromethyl)acetophenone; Ethanone, 1-[3,5-bis(trifluoromethyl)phenyl]-; 1-[3,5-bis(trifluoromethyl)phenyl]ethan-1-one

Gas phase ion energetics data

Data compiled by: John E. Bartmess
Electron affinity determinations
EA (eV) | Method | Reference | Comment |
---|---|---|---|
1.149 ± 0.087 | IMRE | Mishima, Huh, et al., 1995 | ΔGea(343 K)=-27.1 kcal/mol. Reanchored to EA(PhNO2), Kebarle and Chowdhury, 1987. |
1.123 ± 0.087 | IMRE | Huh, Kang, et al., 1999 | ΔG(EA) 343K; anchored to ΔG value. Including anchor ΔS, EA is ca. 0.4 kcal/mol more bound. |

References

Mishima, Huh, et al., 1995
Mishima, M.; Huh, C.; Lee, H.W.; Nakamura, H.; Fujio, M.; Tsuno, Y.,
Electron affinities of acetophenones and methyl benzoates. Varying resonance demand of aromatic radical anions,
Tetrahed. Lett., 1995, 36, 13, 2265, https://doi.org/10.1016/0040-4039(95)00267-G
. [all data]
Kebarle and Chowdhury, 1987
Kebarle, P.; Chowdhury, S.,
Electron affinities and electron transfer reactions,
Chem. Rev., 1987, 87, 513. [all data]
Huh, Kang, et al., 1999
Huh, C.; Kang, C.H.; Lee, H.W.; Nakamura, H.; Mishima, M.; Tsuno, Y.; Yamataka, H.,
Thermodynamic stabilities and resonance demand of aromatic radical anions in the gas phase,
Bull. Chem. Soc. Japan, 1999, 72, 5, 1083-1091, https://doi.org/10.1246/bcsj.72.1083
. [all data]