Tetrahydrofurfuryl chloride
- Formula: C5H9ClO
- Molecular weight: 120.577
- IUPAC Standard InChIKey: IVJLGIMHHWKRAN-UHFFFAOYSA-N
- CAS Registry Number: 3003-84-7
- Chemical structure:
View 3d structure (requires JavaScript / HTML 5) - Other names: Furan, 2-(chloromethyl)tetrahydro-; 2-(Chloromethyl)tetrahydrofuran

Phase change data

Data compiled by: Robert L. Brown and Stephen E. Stein
Quantity | Value | Units | Method | Reference | Comment |
---|---|---|---|---|---|
Tboil | 423.7 | K | N/A | Aldrich Chemical Company Inc., 1990 | |
Tboil | 423. to 424. | K | N/A | Farchan Laboratories, 1990 |

Kovats' RI, non-polar column, isothermal

Column type | Active phase | Temperature (C) | I | Reference | Comment |
---|---|---|---|---|---|
Packed | Silicon High Vacuum Grease (obsolete) | 170. | 930. | Janák, Jonas, et al., 1965 | H2, Celite |

Normal alkane RI, non-polar column, temperature ramp

Column type | Active phase | I | Reference | Comment |
---|---|---|---|---|
Capillary | OV-101 | 877. | Zenkevich, 2005 | 25. m/0.20 mm/0.10 μm, N2/He, 6. K/min; Tstart: 50. C; Tend: 250. C |

References

Aldrich Chemical Company Inc., 1990
Aldrich Chemical Company Inc.,
Catalog Handbook of Fine Chemicals, Aldrich Chemical Company, Inc., Milwaukee WI, 1990, 1. [all data]
Farchan Laboratories, 1990
Farchan Laboratories,
Research Chemicals Catalog, Farchan Laboratories, Gainesville, FL, 1990, 91. [all data]
Janák, Jonas, et al., 1965
Janák, J.; Jonas, J.; Kratochvíl, M.,
Identification of some acetals of the tetrahydrofurane sereis by gas chromatography with the aid of the Kováts indices,
Collect. Czech. Chem. Commun., 1965, 30, 1, 265-276, https://doi.org/10.1135/cccc19650265
. [all data]
Zenkevich, 2005
Zenkevich, I.G.,
Experimentally measured retention indices., 2005. [all data]