2,2'-Bioxirane, (2S,2'S)-
- Formula: C4H6O2
- Molecular weight: 86.0892
- IUPAC Standard InChIKey: ZFIVKAOQEXOYFY-QWWZWVQMSA-N
- CAS Registry Number: 30031-64-2
- Chemical structure:
View 3d structure (requires JavaScript / HTML 5) - Stereoisomers:
- Other names: (2S,2'S)-2,2'-Bioxirane; (2s,3s)-Diepoxybutane

Phase change data

Data compiled by: Robert L. Brown and Stephen E. Stein
Quantity | Value | Units | Method | Reference | Comment |
---|---|---|---|---|---|
Tboil | 417.6 to 418. | K | N/A | Buckingham and Donaghy, 1982 | |
Quantity | Value | Units | Method | Reference | Comment |
Tfus | 297. to 298.7 | K | N/A | Buckingham and Donaghy, 1982 |
Reduced pressure boiling point
Tboil (K) | Pressure (bar) | Reference |
---|---|---|
337. | 0.067 | Buckingham and Donaghy, 1982 |

References

Buckingham and Donaghy, 1982
Buckingham, J.; Donaghy, S.M.,
Dictionary of Organic Compounds: Fifth Edition, Chapman and Hall, New York, 1982, 1. [all data]